program: Gaussian 09
title: 000269589
version: EM64L-G09RevD.01
frameworkgroup: C1[X(C14H15N3O3S)]
method: RPBEPBE
basis: SDD
operation: Freq
keyword: #p
keyword: freq=noraman
keyword: PBEPBE/SDD
title: #p freq=noraman PBEPBE/SDD
converged: YES YES NO NO
title: Mulliken charges:
elementType: S O O O N N N C C C C C C C C C C C C C C H H H H H H H H H H H H H H H
charge: 0.912193 -0.525955 -0.510583 -0.265793 -0.541025 -0.373831 -0.002625 -0.072174 0.515234 -0.519876 -0.238363 -0.225132 -0.354120 -0.429410 0.347893 -0.266392 -0.391891 0.265707 -0.155217 -0.770672 -0.322007 0.233301 0.277780 0.294222 0.283446 0.265142 0.247589 0.296992 0.304197 0.245508 0.263150 0.236158 0.248243 0.257055 0.258209 0.213047
chargesum: 0.00000
title: Mulliken charges with hydrogens summed into heavy atoms:
elementType: S O O O N N N C C C C C C C C C C C C C C
charge: 0.912193 -0.525955 -0.510583 -0.265793 -0.244033 -0.069634 -0.002625 -0.072174 0.515234 -0.008795 0.055859 0.058314 -0.088978 -0.181821 0.347893 -0.020883 -0.128742 0.265707 0.080941 -0.042361 -0.073764
polarizability: 2.80975839e+02 1.04431410e+01 2.40465383e+02 3.30326667e+00 1.62706177e+01 1.44161922e+02
1716.lowfreq: -8.4992 -5.7800 -0.3791 -0.0014 -0.0007 0.0004 6.6530 10.8867 22.6986
frequency: 4.4046 10.5175 22.4575 28.5872 41.5113 55.6208 68.3030 72.6182 90.0149 120.9525 148.1591 176.2101 184.4983 194.5653 218.4212 272.7442 294.1735 308.5758 322.5712 362.9578 388.9590 393.4575 402.3877 406.4017 432.6081 473.2954 512.8261 518.6719 558.8895 572.6231 603.4543 608.9636 615.5426 622.6062 635.8594 709.2147 721.7452 792.4042 804.6964 809.5436 823.3286 842.8910 852.4777 863.1462 863.8804 914.3236 935.9193 947.0806 965.9628 979.4453 982.6281 987.3093 993.6450 998.9034 1022.6910 1026.7408 1041.8645 1051.4494 1091.3622 1110.0223 1117.1278 1182.6595 1195.2559 1209.7461 1218.1186 1231.2967 1233.0879 1253.8573 1296.6765 1320.0943 1335.7903 1345.0686 1387.8746 1389.8993 1407.0797 1422.6330 1449.4485 1449.7167 1461.9355 1466.1402 1474.0283 1483.8393 1546.9731 1567.8117 1593.3060 1595.0893 1620.1966 2981.3814 2997.1510 3034.6838 3096.8656 3103.7028 3133.0691 3135.2942 3140.4940 3142.7509 3147.5168 3164.9150 3167.8762 3170.0138 3337.9154 3556.6070
redmass: 5.7725 5.1057 5.5495 4.2802 4.1726 4.0911 4.8647 1.2696 4.9051 6.2362 5.2772 6.4100 8.8445 8.4567 5.3161 6.4239 3.6532 5.5520 3.5574 5.3153 4.8733 3.6435 4.0557 2.8524 4.1401 3.8905 4.2971 3.4890 1.9396 6.6216 3.9570 1.6759 7.4549 5.1354 4.9871 1.8355 3.6495 4.0979 4.3344 3.4718 3.0342 1.5148 1.3462 2.7901 1.4157 1.3865 1.9800 4.4093 1.3642 1.6614 1.4038 1.4075 4.9543 3.5932 2.3065 3.0328 1.6488 2.4836 3.5236 1.5713 1.3858 1.1222 1.3184 2.8648 1.5402 1.2346 2.1038 1.9109 1.2722 5.9881 1.2496 1.5795 1.5532 2.9646 2.3661 2.1047 1.9635 1.0948 1.2889 1.2199 1.6281 1.7382 5.2867 5.7898 6.3922 6.7611 6.2474 1.0588 1.0363 1.1021 1.0994 1.0993 1.0884 1.0897 1.0909 1.0931 1.0884 1.0960 1.0968 1.1002 1.0748 1.0781
irintensity: 1.9937 4.5125 4.2055 1.4252 0.9679 4.2351 2.3684 1.0581 4.7863 3.6081 5.8926 1.1532 8.8336 0.0432 2.3381 12.0366 10.7342 24.5415 4.6138 3.1829 14.6805 10.8690 7.8517 0.3824 76.1079 97.7418 9.0238 42.2759 56.4741 3.5385 4.1603 62.5223 1.7511 5.5003 37.3635 32.3873 0.6311 15.4389 38.4607 85.8310 18.3974 24.2052 6.6401 14.8404 89.1810 3.3336 16.8479 37.9221 0.1802 4.8526 0.8258 1.5537 1.4863 4.6233 19.5491 0.1538 14.1518 34.3378 7.8355 15.9063 6.8393 9.4965 3.7780 3.6130 5.3605 1.9480 1.2312 158.9698 4.7528 2.3539 1.4587 11.8563 44.3048 28.2922 21.0402 19.2244 23.6654 21.5844 95.0346 32.9797 0.3747 150.1999 6.1884 3.7314 13.4117 4.8591 182.4633 39.0479 9.5639 30.4991 14.0714 11.9328 1.2444 10.4866 22.3210 5.3849 2.9515 0.6550 7.7703 24.6825 15.3413 14.8553
temp: 298.150 k
press: 1.00000 atm
elementType: 16 8 8 8 7 7 7 6 6 6 6 6 6 6 6 6 6 6 6 6 6 1 1 1 1 1 1 1 1 1 1 1 1 1 1 1
symmnumber: 1
zpe: 708440.9 jmol-1
zpe.correction: 0.269831 hartree
zpe.thermalcorrener: 0.290862 hartree
zpe.thermalcorrenthalpy: 0.291806 hartree
zpe.thermalcorrgfe: 0.213348 hartree
zpe.sumelectzpe: -1328.783804 hartree
zpe.sumelectthermal: -1328.762773 hartree
zpe.sumelectthermalent: -1328.761829 hartree
zpe.sumelectthermalfe: -1328.840287 hartree
dipole: 0.2869 3.4234 -4.5636
dipole: 5.7121
quadrupole: -123.7956 -134.9863 -136.2203
quadrupole: 5.7262 12.3831 8.9674
quadrupole: 7.8718 -3.3189 -4.5529 5.7262 12.3831 8.9674
hfenergy: -1329.0536353 hartree
pointgroup: C01 [X(C14H15N3O3S1)]
dipole: -0.4479301 -1.1755052 1.8622632 debye
polarizability: 271.5598554|-18.6723964|248.74587|20.6405078|4.6426934|145.2974191 unknown
InChI: InChI=1S/C14H15N3O3S/c1-11(18)16-9-12-4-6-14(7-5-12)21(19,20)17-13-3-2-8-15-10-13/h2-8,10,16-17H,9H2,1H3
charge 0 multiplicity 1
36 atoms
S  2.441954 1.288291 -0.114292
O  3.111506 2.717856 0.283943
O  2.825482 0.505555 -1.491965
O  -5.544507 0.861702 -1.905198
N  2.841023 0.16183 1.487797
N  -4.424433 0.477913 0.096917
N  1.50756 -3.278613 1.025376
C  0.571324 1.42156 -0.039404
C  -2.20775 1.635378 0.049169
C  -3.72587 1.771058 0.080331
C  -0.183546 0.620144 -0.912852
C  0.008117 2.331762 0.867932
C  -1.58812 0.736769 -0.857946
C  -1.400405 2.430025 0.902457
C  2.856403 -1.237532 1.234082
C  4.045608 -1.989693 1.023443
C  1.613976 -1.938588 1.226368
C  -5.311586 0.110091 -0.91058
C  3.947693 -3.384865 0.845952
C  -5.980943 -1.248072 -0.733129
C  2.666154 -3.984501 0.841488
H  -4.032716 2.385047 0.948835
H  -4.087971 2.2824 -0.833641
H  0.3153 -0.052483 -1.617975
H  0.645138 2.944743 1.512783
H  -2.210057 0.131176 -1.525437
H  -1.872458 3.130877 1.600814
H  3.780307 0.542455 1.724974
H  -4.256642 -0.159751 0.876582
H  5.019392 -1.485986 1.000569
H  0.682202 -1.389959 1.405584
H  4.841611 -3.997328 0.692905
H  2.549289 -5.062924 0.688397
H  -7.070969 -1.102681 -0.636011
H  -5.813784 -1.852819 -1.640401
H  -5.616684 -1.809438 0.144533
