program: Gaussian 09
title: 000269597
version: EM64L-G09RevD.01
frameworkgroup: C1[X(C18H13FN4O6)]
method: RPBEPBE
basis: SDD
operation: Freq
keyword: #p
keyword: freq=noraman
keyword: PBEPBE/SDD
title: #p freq=noraman PBEPBE/SDD
converged: YES YES NO NO
title: Mulliken charges:
elementType: F O O O O O O N N N N C C C C C C C C C C C C C C C C C C H H H H H H H H H H H H H
charge: -0.155514 -0.272599 -0.229381 -0.205931 -0.203394 -0.200901 -0.196291 -0.215593 -0.172943 0.026985 0.029544 -0.585207 -0.579260 0.294107 0.513577 0.553529 0.168365 -0.191610 0.175151 -0.361491 -0.350596 -0.423650 -0.329418 -0.366284 -0.363507 -0.350646 -0.358889 0.378036 0.380555 0.269687 0.264165 0.285519 0.251614 0.284640 0.277199 0.285261 0.246626 0.267588 0.287340 0.288629 0.291626 0.293359
chargesum: 0.00000
title: Mulliken charges with hydrogens summed into heavy atoms:
elementType: F O O O O O O N N N N C C C C C C C C C C C C C C C C C C
charge: -0.155514 -0.272599 -0.229381 -0.205931 -0.203394 -0.200901 -0.196291 -0.215593 -0.172943 0.026985 0.029544 -0.051355 -0.042127 0.294107 0.513577 0.553529 0.168365 0.093030 0.175151 -0.084292 -0.065334 -0.177023 -0.061829 -0.078944 -0.074878 -0.059020 -0.065531 0.378036 0.380555
polarizability: 2.77981088e+02 -7.46160581e+00 2.78550574e+02 -1.12904199e+01 -1.77543770e+00 1.90884719e+02
1716.lowfreq: -5.7583 -4.8182 -0.0001 0.0004 0.0005 1.7268 6.5304 13.7653 18.6866
frequency: 5.6205 13.6418 18.6470 27.8394 33.3791 42.0528 65.6526 68.4857 83.3752 85.1639 107.3009 121.5779 152.9952 172.8230 195.7797 254.1151 261.1435 264.4807 277.1243 287.1111 299.0961 351.1076 361.6064 376.6609 393.7746 400.2657 408.7152 409.3028 411.5419 436.6305 453.9520 469.6283 477.2145 504.6885 506.5388 552.7531 610.5458 621.9463 627.4857 630.4252 631.7727 661.1607 673.5405 674.9284 707.4745 727.6597 730.0703 740.6068 755.9698 771.1138 777.7169 818.3564 821.8667 856.0168 861.3011 865.2508 867.6692 874.6823 885.9692 940.2659 973.0844 980.4295 992.5331 994.6257 1003.0687 1005.1107 1007.2647 1009.2596 1090.9526 1091.2072 1093.9963 1103.8416 1120.8690 1126.1499 1182.3199 1184.5608 1198.5530 1210.8143 1212.4300 1220.0510 1220.2649 1229.7230 1288.5561 1299.1984 1306.0600 1323.5951 1337.3070 1352.8389 1370.2491 1370.3943 1376.8954 1400.8183 1401.1192 1414.9711 1425.7158 1426.9334 1454.7672 1465.0935 1482.2421 1482.4981 1582.7060 1598.4409 1600.7761 1609.0875 1611.0219 1632.6588 1660.5683 3021.8779 3052.0709 3082.2457 3116.3305 3135.4179 3147.0399 3153.8666 3155.3689 3183.2846 3183.4096 3185.5329 3185.9926 3187.9333
redmass: 8.4182 6.9751 6.0713 9.4544 8.8571 9.2150 7.3087 6.2002 10.2209 10.2038 10.0151 9.8408 9.1286 9.0344 9.1360 6.6344 7.0929 5.6679 6.8249 7.9685 8.8209 7.1145 3.6794 4.0140 6.3041 4.2292 2.8878 2.9099 3.1253 5.3809 4.1568 6.0882 5.6848 7.0422 6.5473 5.5354 6.1093 6.0352 6.5534 5.8176 5.9985 4.7782 4.5738 4.5019 10.5242 6.0432 7.0302 5.9994 7.5898 6.2609 6.3201 4.6682 4.6159 1.3155 1.3139 1.4343 1.9732 1.8483 1.8267 3.5158 3.0102 2.0910 1.5209 1.3679 1.4337 1.4329 2.8763 2.8290 3.2763 3.2545 2.2244 2.0766 1.7179 1.5594 1.3345 1.3835 1.9875 2.3525 2.6263 6.0343 4.8403 4.5352 2.0207 1.3734 1.7645 1.7149 1.6897 1.5837 2.0933 6.3119 2.5973 6.3537 6.4534 3.4922 3.0212 3.1113 1.1523 1.1735 2.2852 2.2163 9.3437 7.6109 7.7030 6.1626 6.2339 10.2575 7.7107 1.0596 1.0588 1.1040 1.1058 1.0909 1.0912 1.0909 1.0912 1.0948 1.0943 1.0954 1.0959 1.0944
irintensity: 0.2643 0.2597 0.2975 0.5562 1.0546 0.7664 0.0293 0.0340 3.0387 4.9865 1.0847 3.8750 4.2821 2.3608 5.4481 0.4686 1.2214 0.0809 0.4104 1.9372 1.6925 0.3025 4.1828 6.9278 14.2906 10.1455 3.1138 0.3866 19.2827 3.1557 3.1599 0.9422 4.0766 1.0141 1.0513 22.0717 11.4358 3.1130 0.3642 5.0107 4.1451 1.8760 33.6144 45.3320 4.4618 15.5314 8.5240 12.9472 28.0310 19.3882 58.5395 9.5791 8.5417 8.5525 2.8256 31.8760 11.5849 18.9689 53.7443 2.0053 22.1458 26.5036 2.3628 1.4115 0.6259 1.1107 7.2105 5.4170 12.3474 17.0499 60.5152 46.4201 13.2996 2.2171 37.5085 60.6166 71.9006 24.9103 9.5440 240.2672 309.4072 63.0936 78.3928 20.2470 73.2656 23.2001 10.5008 9.7024 16.4370 108.3717 96.7060 1.7133 6.0340 82.9933 43.1029 24.1995 48.3902 52.5018 11.7203 15.4032 472.0502 3.1502 0.5653 26.3374 28.1435 108.4286 173.7920 30.8444 10.8846 12.1215 0.6253 8.9455 1.7650 1.0033 0.2012 0.4516 0.4429 4.2301 2.4052 3.0221
temp: 298.150 k
press: 1.00000 atm
elementType: 9 8 8 8 8 8 8 7 7 7 7 6 6 6 6 6 6 6 6 6 6 6 6 6 6 6 6 6 6 1 1 1 1 1 1 1 1 1 1 1 1 1
symmnumber: 1
zpe: 770404.5 jmol-1
zpe.correction: 0.293432 hartree
zpe.thermalcorrener: 0.318001 hartree
zpe.thermalcorrenthalpy: 0.318945 hartree
zpe.thermalcorrgfe: 0.232901 hartree
zpe.sumelectzpe: -1461.716308 hartree
zpe.sumelectthermal: -1461.691739 hartree
zpe.sumelectthermalent: -1461.690795 hartree
zpe.sumelectthermalfe: -1461.776839 hartree
dipole: 3.5258 -7.6949 -4.4206
dipole: 9.5491
quadrupole: -188.3355 -198.7123 -174.3176
quadrupole: -11.2319 -0.5305 2.5549
quadrupole: -1.2137 -11.5905 12.8042 -11.2319 -0.5305 2.5549
hfenergy: -1462.0097398 hartree
pointgroup: C01 [X(C18H13F1N4O6)]
dipole: -1.3999094 -3.1221076 1.5514309 debye
polarizability: 278.6382159|7.4162486|278.9491888|-4.3896611|4.3589488|189.8289764 unknown
InChI: InChI=1S/C18H13FN4O6/c19-16-11-20(9-12-1-5-14(6-2-12)22(26)27)18(25)21(17(16)24)10-13-3-7-15(8-4-13)23(28)29/h1-8,11H,9-10H2
charge 0 multiplicity 1
42 atoms
F  0.004127 -3.693809 -2.692365
O  0.142583 -1.388267 2.305289
O  2.477345 -3.097913 -1.410076
O  4.150188 4.381947 0.855999
O  5.150886 3.645747 -1.056659
O  -6.361107 2.433979 -1.491433
O  -4.576161 3.767452 -0.999558
N  1.300013 -2.265011 0.455437
N  -1.088484 -2.260717 0.507936
N  4.456467 3.451869 0.014077
N  -5.176385 2.625963 -1.016843
C  2.601426 -1.948067 1.125823
C  -2.367725 -1.954893 1.210771
C  0.12474 -1.934611 1.164363
C  3.08088 -0.530753 0.830541
C  -3.100885 -0.75885 0.616777
C  1.371517 -2.856748 -0.855048
C  -1.10952 -2.826812 -0.763149
C  0.050355 -3.123441 -1.423594
C  2.773291 0.528847 1.723565
C  3.848486 -0.265103 -0.334378
C  -4.403655 -0.909195 0.080563
C  -2.487088 0.52191 0.612422
C  3.220552 1.838892 1.462968
C  4.301731 1.03936 -0.61088
C  -5.094227 0.19604 -0.457602
C  -3.158979 1.636031 0.077152
C  3.97906 2.07288 0.295491
C  -4.456216 1.453193 -0.451665
H  3.32422 -2.689466 0.749193
H  2.442594 -2.08992 2.206163
H  -2.087309 -1.754602 2.259491
H  -3.001641 -2.858562 1.183371
H  -2.087278 -3.016502 -1.212124
H  2.17555 0.319514 2.616701
H  4.080548 -1.08558 -1.021578
H  -4.8866 -1.893367 0.087622
H  -1.486269 0.644626 1.040872
H  3.001165 2.670815 2.137147
H  4.894897 1.268182 -1.499991
H  -6.099886 0.104959 -0.875932
H  -2.708811 2.632083 0.06564
