program: Gaussian 09
title: 000269554
version: EM64L-G09RevD.01
frameworkgroup: C1[X(C14H18O4)]
method: RPBEPBE
basis: SDD
operation: Freq
keyword: #pfreq=noraman
keyword: PBEPBE/SDD
title: #p freq=noraman PBEPBE/SDD
converged: YES YES NO NO
title: Mulliken charges:
elementType: O O O O C C C C C C C C C C C C C C H H H H H H H H H H H H H H H H H H
charge: -0.302218 -0.268671 -0.319248 -0.268955 0.147723 -0.465780 0.196831 -0.430340 -0.509439 0.155180 -0.297106 -0.330365 0.221075 0.181817 -0.375593 -0.374435 -0.528625 -0.534182 0.213111 0.222984 0.207853 0.235893 0.228305 0.250603 0.210163 0.214753 0.251882 0.218538 0.241124 0.240827 0.253910 0.213541 0.217303 0.242860 0.219964 0.218717
chargesum: 0.00000
title: Mulliken charges with hydrogens summed into heavy atoms:
elementType: O O O O C C C C C C C C C C C C C C
charge: -0.302218 -0.268671 -0.319248 -0.268955 0.147723 -0.029685 0.196831 0.013405 -0.030531 0.155180 0.127810 0.140055 0.221075 0.181817 -0.134469 -0.133609 0.156130 0.147359
polarizability: 2.11732553e+02 -6.04698336e+00 1.70083543e+02 -2.16213081e-01 3.48138753e+00 1.04953246e+02
1716.lowfreq: -12.4484 -3.8871 0.0005 0.0006 0.0009 9.2859 25.2264 62.9308 80.5628
frequency: 24.8191 62.8992 80.5350 94.8471 132.1556 135.0278 163.5547 177.5070 189.6928 201.7712 220.3762 241.8500 262.0259 272.2578 278.8509 325.5999 334.3615 371.4340 400.2412 417.3052 460.6879 477.8219 525.8456 559.4622 586.2237 604.1161 624.6456 641.3216 684.6428 690.7701 753.0555 786.7502 807.8937 818.6265 843.1783 859.6532 883.4398 892.5432 916.2177 922.0718 928.9025 973.5138 979.2370 1006.7957 1016.7441 1057.0014 1064.5487 1093.3391 1105.1705 1107.0847 1113.7496 1141.2870 1143.4150 1151.3263 1159.8220 1171.3777 1179.1494 1185.6316 1199.6395 1217.5437 1242.4869 1245.6268 1271.3728 1317.6086 1331.9040 1335.7274 1341.4072 1351.3585 1368.3274 1413.3165 1420.3730 1435.5523 1450.1569 1453.8698 1456.6886 1462.4941 1464.5519 1467.5382 1473.4993 1474.5066 1477.4212 1482.2864 1585.2452 1597.2171 2956.8060 2959.4912 2964.0306 2987.9713 2999.6715 3002.4001 3027.1657 3040.0510 3043.4874 3056.9126 3059.5183 3072.3457 3075.3669 3103.9824 3105.0172 3121.1299 3142.1217 3168.3998
redmass: 3.6643 3.1350 3.2454 3.1538 3.1112 3.6629 3.1567 1.0698 3.5772 2.2107 2.1468 2.0123 4.2718 2.3511 3.9814 3.4417 3.8350 3.9700 6.0452 3.8020 3.9204 4.2676 3.1102 4.1621 4.7629 3.6548 2.5346 3.1154 7.1079 6.8099 3.6663 5.1924 1.5642 3.3870 2.4940 1.9890 1.9808 3.7393 2.7286 1.7902 2.3953 4.4025 4.1912 5.1880 4.0940 2.4197 2.7460 1.8767 1.7344 1.2994 1.2673 1.9591 1.4510 1.3780 1.5244 1.2655 1.3416 1.6084 1.3212 2.2523 4.3760 1.6477 1.7742 1.2764 1.4787 1.5452 1.4428 1.5421 4.1279 2.5473 1.4161 1.2351 1.1210 1.0813 1.5880 1.1871 1.2250 1.0510 1.0888 1.0919 1.1324 1.0600 7.3414 7.6646 1.0329 1.0309 1.0681 1.0634 1.0604 1.0632 1.0580 1.0911 1.1037 1.1023 1.1015 1.1012 1.1020 1.1095 1.1036 1.0992 1.0880 1.0954
irintensity: 2.8028 4.5493 2.2970 8.3220 5.1193 3.4704 5.2438 0.1643 3.5192 2.8806 1.4429 0.2352 1.4928 1.8283 6.5524 5.6087 1.3849 3.4700 8.6511 2.2744 2.9718 11.3686 1.4326 7.6850 2.3526 4.9629 4.6508 2.9157 12.1873 7.8741 21.6090 13.3037 28.1740 17.1228 37.2940 0.6721 18.5920 2.8277 42.4527 20.2102 30.4705 14.0195 37.3579 186.3846 27.7003 35.7575 4.7764 3.4387 1.2217 1.2019 0.2406 25.5354 2.2725 0.5153 11.9701 1.8539 0.3849 18.8965 29.1537 187.5680 16.5019 33.2985 74.4484 2.9727 2.6566 2.4419 2.9632 4.6295 4.1715 3.4566 38.0742 30.4363 5.2203 13.6095 129.6145 2.5207 49.5374 12.1910 9.9009 10.6120 5.0747 8.3998 24.6010 1.5767 77.0651 73.5123 19.1505 86.6004 38.0582 19.5414 51.3185 19.0316 48.8960 30.0162 41.4763 29.8524 30.8939 33.4395 29.7371 24.9437 7.9404 14.0179
temp: 298.150 k
press: 1.00000 atm
elementType: 8 8 8 8 6 6 6 6 6 6 6 6 6 6 6 6 6 6 1 1 1 1 1 1 1 1 1 1 1 1 1 1 1 1 1 1
symmnumber: 1
zpe: 774748.1 jmol-1
zpe.correction: 0.295086 hartree
zpe.thermalcorrener: 0.312044 hartree
zpe.thermalcorrenthalpy: 0.312988 hartree
zpe.thermalcorrgfe: 0.250817 hartree
zpe.sumelectzpe: -843.766959 hartree
zpe.sumelectthermal: -843.750001 hartree
zpe.sumelectthermalent: -843.749057 hartree
zpe.sumelectthermalfe: -843.811228 hartree
dipole: 1.0172 1.7548 -0.7212
dipole: 2.1527
quadrupole: -82.3619 -99.0057 -110.7971
quadrupole: 2.2971 0.1433 -0.5155
quadrupole: 15.0263 -1.6174 -13.4089 2.2971 0.1433 -0.5155
hfenergy: -844.0620451 hartree
pointgroup: C01 [X(C14H18O4)]
dipole: -0.3870336 0.664881 0.3541888 debye
polarizability: 211.4360584|6.3334083|170.3034437|-4.9566814|1.1481657|105.0298397 unknown
InChI: InChI=1S/C14H18O4/c1-15-11-5-6-12(16-2)13-10(11)4-3-7-14(13)17-8-9-18-14/h5-6H,3-4,7-9H2,1-2H3
charge 0 multiplicity 1
36 atoms
O  2.474232 -0.37258 0.970537
O  1.910576 -1.135153 -1.208462
O  1.449394 2.013608 -0.04511
O  -3.546175 -0.575896 0.305451
C  1.377449 -0.980707 0.174972
C  1.111705 -2.393964 0.705396
C  0.12762 -0.085592 0.181944
C  -0.096618 -3.013133 -0.016891
C  -1.364262 -2.204648 0.314579
C  -1.159088 -0.696904 0.233339
C  3.645942 -0.18689 0.084432
C  3.056879 -0.208293 -1.338674
C  0.203955 1.337791 0.097394
C  -2.324239 0.125615 0.228952
C  -0.960772 2.126971 0.084506
C  -2.2360 1.531304 0.150997
C  1.923912 2.661526 1.193234
C  -4.778525 0.21118 0.268812
H  0.920838 -2.33144 1.794147
H  2.031138 -2.984381 0.550419
H  -0.231891 -4.068138 0.284809
H  0.095468 -3.000598 -1.106203
H  -1.708317 -2.452703 1.340735
H  -2.201755 -2.487926 -0.347954
H  4.363458 -1.013789 0.251221
H  4.111862 0.778421 0.343966
H  2.70792 0.792796 -1.641776
H  3.733523 -0.643757 -2.091624
H  -0.857223 3.213723 -0.003813
H  -3.130416 2.160008 0.130342
H  2.188698 1.88874 1.938139
H  1.151609 3.340209 1.605844
H  2.813027 3.246538 0.907649
H  -5.59291 -0.52595 0.329938
H  -4.864471 0.784071 -0.675307
H  -4.840242 0.905941 1.129463
