program: Gaussian 09
title: 000269547
version: EM64L-G09RevD.01
frameworkgroup: C1[X(C15H14O3)]
method: RPBEPBE
basis: SDD
operation: Freq
keyword: #pfreq=noraman
keyword: PBEPBE/SDD
title: #p freq=noraman PBEPBE/SDD
converged: YES YES NO NO
title: Mulliken charges:
elementType: O O O C C C C C C C C C C C C C C C H H H H H H H H H H H H H H
charge: -0.289247 -0.308332 -0.231774 0.315967 -0.651783 0.181160 -0.356469 -0.342385 0.251135 -0.242737 -0.216060 0.376404 -0.323421 -0.401318 -0.208304 -0.194636 -0.246830 -0.531916 0.249682 0.267465 0.245813 0.242965 0.227948 0.228296 0.301679 0.256022 0.229825 0.232014 0.231090 0.265589 0.211878 0.230280
chargesum: 0.00000
title: Mulliken charges with hydrogens summed into heavy atoms:
elementType: O O O C C C C C C C C C C C C C C C
charge: -0.289247 -0.308332 -0.231774 0.315967 -0.134636 0.181160 -0.110656 -0.099420 0.251135 -0.014788 0.012236 0.376404 -0.021742 -0.145296 0.021521 0.037378 -0.015740 0.175830
polarizability: 2.24890347e+02 1.44598875e+01 1.65065663e+02 6.30872467e+00 9.07997313e+00 1.16597059e+02
1716.lowfreq: -10.5534 -4.9349 -0.0008 -0.0002 0.0003 1.3522 6.9078 20.0176 26.1905
frequency: 5.7972 19.9798 26.1137 58.7928 75.3411 95.2136 128.2871 148.1433 182.5635 197.8019 245.0689 257.4942 328.1664 330.8605 351.2152 409.6948 423.4379 460.8865 486.1818 503.2663 516.3292 547.3539 572.7680 607.1104 631.2255 693.2885 694.7471 726.8341 743.6649 765.6719 773.0420 775.5586 828.4292 844.5568 871.7245 895.5237 924.5179 936.7005 949.2593 957.3222 977.6447 983.8043 986.9075 995.7494 1023.2694 1034.3437 1068.1750 1081.2859 1104.6865 1119.7815 1146.1274 1150.9129 1168.4000 1170.3078 1177.5359 1190.5767 1216.5559 1221.7537 1280.2538 1292.2750 1311.8646 1377.6488 1382.9901 1427.6353 1442.1447 1442.7172 1448.1351 1460.8575 1469.2025 1479.5983 1481.9625 1589.0346 1590.2809 1603.4665 1607.7321 1637.6026 2964.2983 3034.0579 3062.8691 3106.3850 3118.0611 3123.9786 3132.7821 3133.5157 3144.1265 3149.4825 3160.1712 3165.7332 3173.5110 3212.3139
redmass: 5.1057 4.3147 5.5361 4.6636 3.9799 5.0159 4.2738 4.5821 1.5945 1.9678 4.9129 5.4281 6.4344 3.8977 2.8744 2.9464 4.3916 3.6202 4.0305 3.5368 4.5693 5.3120 4.0382 6.4236 6.3035 2.5695 3.9660 3.4282 5.6340 1.5349 2.7367 2.0710 3.4752 1.2540 1.7245 5.3024 1.4030 1.9897 1.7991 3.9740 1.3604 1.3245 6.2167 1.3059 2.1435 2.0968 2.4583 1.5406 2.3285 1.2424 2.5109 1.3736 1.0871 1.0653 1.9081 1.3469 2.7369 1.6660 1.4418 1.4826 1.3266 7.0773 9.5107 1.4946 1.9654 1.6291 1.1998 1.0600 2.1997 2.1223 1.1093 6.8260 6.3738 6.6010 6.4554 10.1453 1.0311 1.0584 1.1041 1.1036 1.1020 1.0866 1.0854 1.0889 1.0903 1.0941 1.0950 1.1008 1.0997 1.0946
irintensity: 0.5061 0.2210 0.7513 3.4815 6.0752 5.3649 0.3179 0.6459 4.6016 6.4395 5.1065 1.0704 1.8224 9.3387 4.0581 0.0077 8.3352 5.0281 11.4811 4.8681 15.9116 0.0628 4.4219 1.0963 5.1561 28.9235 17.5972 17.3331 1.5478 88.7040 20.0609 55.0486 0.9595 0.0075 1.8626 53.5150 10.7340 0.6486 7.7679 42.7889 0.0675 0.2413 4.2781 1.6076 6.3019 18.2923 198.0401 22.1150 327.2694 2.3252 137.7152 0.7031 1.7804 1.8882 28.6935 41.2837 76.1304 149.0968 1.5561 60.3169 1.3879 0.5829 9.1588 11.9383 5.3730 16.1171 22.7277 6.1393 92.8692 43.6426 27.4305 8.5072 23.0613 2.3553 14.4861 186.4116 64.6933 12.8320 21.9725 2.7435 27.5423 2.9979 0.1441 8.1413 15.9558 22.7095 26.5309 21.9046 11.7789 4.0655
temp: 298.150 k
press: 1.00000 atm
elementType: 8 8 8 6 6 6 6 6 6 6 6 6 6 6 6 6 6 6 1 1 1 1 1 1 1 1 1 1 1 1 1 1
symmnumber: 1
zpe: 656836.2 jmol-1
zpe.correction: 0.250176 hartree
zpe.thermalcorrener: 0.266535 hartree
zpe.thermalcorrenthalpy: 0.267479 hartree
zpe.thermalcorrgfe: 0.201932 hartree
zpe.sumelectzpe: -804.365395 hartree
zpe.sumelectthermal: -804.349036 hartree
zpe.sumelectthermalent: -804.348091 hartree
zpe.sumelectthermalfe: -804.413639 hartree
dipole: 0.9409 1.0044 -0.9237
dipole: 1.6575
quadrupole: -92.4608 -98.0148 -103.5234
quadrupole: 3.0824 5.7192 3.6885
quadrupole: 5.5389 -0.0152 -5.5237 3.0824 5.7192 3.6885
hfenergy: -804.6155704 hartree
pointgroup: C01 [X(C15H14O3)]
dipole: 0.3182976 0.5538531 -0.1311737 debye
polarizability: 221.3136247|16.9495782|150.2956446|12.2503005|26.7099001|134.9437997 unknown
InChI: InChI=1S/C15H14O3/c1-17-14-10-6-5-7-12(14)11-15(16)18-13-8-3-2-4-9-13/h2-10H,11H2,1H3
charge 0 multiplicity 1
32 atoms
O  1.380292 -0.226442 0.914586
O  -3.086262 -2.109822 -0.263199
O  0.450858 -1.482443 -0.84967
C  -1.977278 -0.150013 0.685043
C  -0.852794 -1.041989 1.204681
C  -3.041497 -0.70682 -0.074326
C  -1.984501 1.244193 0.937521
C  -4.083977 0.111373 -0.569031
C  0.363878 -0.974622 0.288628
C  -3.017354 2.068831 0.440542
C  -4.069366 1.499778 -0.315592
C  2.660162 0.07617 0.343521
C  3.08757 -0.278486 -0.957543
C  3.497844 0.797219 1.224229
C  4.386723 0.109495 -1.362303
C  4.788743 1.173685 0.800291
C  5.23896 0.830779 -0.49699
C  -2.75693 -2.568296 -1.631528
H  -0.55348 -0.743673 2.221465
H  -1.206629 -2.087207 1.21089
H  -1.168067 1.682279 1.524244
H  -4.905916 -0.350581 -1.127021
H  -3.005719 3.144756 0.644929
H  -4.879517 2.132037 -0.695549
H  2.432755 -0.837589 -1.62578
H  3.126039 1.049585 2.22185
H  4.728674 -0.15989 -2.367712
H  5.439659 1.73235 1.481307
H  6.241514 1.122485 -0.827353
H  -1.69693 -2.349745 -1.857779
H  -3.414525 -2.084924 -2.379892
H  -2.933227 -3.654868 -1.628266
