program: Gaussian 09
title: 000269555
version: EM64L-G09RevD.01
frameworkgroup: C1[X(C14H20O4)]
method: RPBEPBE
basis: SDD
operation: Freq
keyword: #pfreq=noraman
keyword: PBEPBE/SDD
title: #p freq=noraman PBEPBE/SDD
converged: YES YES NO NO
title: Mulliken charges:
elementType: O O O O C C C C C C C C C C C C C C H H H H H H H H H H H H H H H H H H H H
charge: -0.290143 -0.277920 -0.420208 -0.230735 -0.549546 0.480718 -0.386550 -0.093358 0.265766 0.196662 -0.639254 0.172767 -0.474440 -0.843633 -0.824885 0.173859 -0.522875 -0.534870 0.199573 0.200263 0.233170 0.256280 0.248193 0.252732 0.243624 0.224688 0.264585 0.231614 0.218700 0.229096 0.271378 0.231326 0.212109 0.225954 0.221075 0.241868 0.218028 0.374388
chargesum: 0.00000
title: Mulliken charges with hydrogens summed into heavy atoms:
elementType: O O O O C C C C C C C C C C C C C C
charge: -0.290143 -0.277920 -0.045820 -0.230735 -0.149710 0.480718 0.102901 -0.093358 0.265766 0.196662 -0.391061 0.172767 0.021916 -0.122746 -0.105711 0.173859 0.146513 0.146101
polarizability: 2.02468935e+02 -1.04923226e+01 1.79778213e+02 1.97384777e+01 4.34797613e+00 1.23811290e+02
1716.lowfreq: 0.0000 0.0008 0.0008 1.2218 5.0940 7.6983 16.6709 23.3853 41.7776
frequency: 16.6299 23.2421 41.7562 64.6967 72.4648 76.6536 92.8718 98.7493 105.6894 127.1662 151.2109 157.1448 177.3692 193.1227 212.7509 224.2176 258.7308 281.2186 289.3871 314.0098 325.5656 332.6563 376.7540 429.1560 444.6311 481.1150 494.6600 510.0329 544.5876 589.9577 593.7383 620.8061 647.5696 663.3396 677.4665 745.2795 769.4829 798.2644 846.6347 858.8163 866.9267 907.1323 956.5270 982.2379 1011.8572 1017.7302 1024.6164 1052.7213 1054.7341 1063.2320 1082.8339 1084.2266 1102.2321 1110.8312 1111.8270 1142.8837 1150.5744 1159.3044 1201.7846 1226.1703 1233.8013 1255.8913 1271.5684 1291.4133 1312.8613 1339.2973 1366.6727 1369.1885 1388.4877 1398.3981 1404.0012 1435.7717 1439.2342 1441.6914 1451.7176 1457.0033 1463.3610 1465.1819 1467.5323 1472.5408 1474.0241 1481.5668 1481.6727 1487.8706 1493.0910 1592.5060 1604.2857 1669.3932 2951.3303 2954.5025 2971.5534 2973.0381 2977.0535 2978.0853 3014.4963 3031.0982 3035.4648 3040.3484 3043.9366 3044.6976 3051.6062 3082.6039 3100.9241 3105.8601 3116.1050 3118.8123 3147.1666 3508.2104
redmass: 10.6989 5.3310 4.6105 3.3257 1.1776 1.9684 2.7903 2.2127 2.8368 3.4633 1.1004 3.3426 1.3163 2.3791 1.9628 3.5224 1.9376 3.0556 2.4705 3.4469 2.5891 3.8037 5.0087 4.6104 4.5157 4.5650 4.1463 2.2886 3.7138 3.3511 3.8334 3.5374 1.3995 4.8008 5.1415 1.2109 3.4224 3.0116 1.6527 1.9665 3.0338 4.2932 4.3430 3.0166 2.6157 2.2327 1.4416 2.5025 1.7826 1.9813 2.4634 2.6913 3.4657 1.2488 1.2675 1.2418 1.4074 1.4522 4.2026 1.6466 1.3905 1.3112 1.4750 1.1418 3.2784 1.7472 1.7996 6.3424 1.2582 1.2219 2.2649 1.2434 1.0874 1.4139 1.3143 1.0994 1.1057 1.0514 1.1022 1.1404 1.0878 1.1220 1.0925 1.5321 1.1166 6.9849 7.3950 8.2755 1.0316 1.0331 1.0409 1.0416 1.0632 1.0611 1.0612 1.0984 1.1029 1.1036 1.0951 1.0949 1.0934 1.1042 1.0979 1.1006 1.0961 1.0991 1.0903 1.0638
irintensity: 1.0284 0.3181 0.0239 3.0252 0.3917 0.4143 3.6518 0.4567 4.1755 1.8918 0.3907 1.5975 0.7747 3.0781 0.8940 3.5197 2.6124 2.2095 3.3340 3.6704 4.1316 2.2672 5.0990 20.3948 6.4656 6.2871 3.6281 34.5918 12.5534 7.1434 11.9495 3.9582 120.6110 8.8617 1.1554 13.1674 1.5127 11.8787 6.2801 12.5124 7.8596 9.2447 43.2961 21.5309 78.0531 139.9535 9.8235 25.5113 7.8286 2.0792 117.9895 21.3882 120.2077 0.2895 1.3653 4.7760 2.6970 13.4174 104.7142 6.2377 11.2210 12.5557 41.5988 4.6469 17.5363 43.8044 38.0604 12.0510 2.0855 23.8313 42.2114 4.6942 20.6447 6.2028 1.6524 11.4614 7.2444 13.3003 7.2429 97.6262 1.4809 10.8466 20.4873 21.5959 32.8238 32.3880 7.8208 197.8958 70.2177 64.8155 57.1648 15.5037 3.6184 46.7710 14.6011 22.3177 48.8836 45.8463 1.2258 41.0076 6.9670 27.8331 14.8275 28.1491 7.4563 26.3353 10.9026 17.1612
temp: 298.150 k
press: 1.00000 atm
elementType: 8 8 8 8 6 6 6 6 6 6 6 6 6 6 6 6 6 6 1 1 1 1 1 1 1 1 1 1 1 1 1 1 1 1 1 1 1 1
symmnumber: 1
zpe: 821217.8 jmol-1
zpe.correction: 0.312785 hartree
zpe.thermalcorrener: 0.333389 hartree
zpe.thermalcorrenthalpy: 0.334333 hartree
zpe.thermalcorrgfe: 0.261191 hartree
zpe.sumelectzpe: -844.984626 hartree
zpe.sumelectthermal: -844.964023 hartree
zpe.sumelectthermalent: -844.963078 hartree
zpe.sumelectthermalfe: -845.036221 hartree
dipole: 0.4173 -0.0219 -2.9551
dipole: 2.9845
quadrupole: -102.9656 -93.5985 -110.6744
quadrupole: -0.3766 3.5648 2.6836
quadrupole: -0.5528 8.8144 -8.2616 -0.3766 3.5648 2.6836
hfenergy: -845.2974114 hartree
pointgroup: C01 [X(C14H20O4)]
dipole: 0.158738 -0.0002642 1.1634013 debye
polarizability: 201.7517562|11.6198611|180.5579178|-19.4124993|4.3526699|123.7487639 unknown
InChI: InChI=1S/C14H20O4/c1-9-10(2)14(18-4)11(8-12(9)17-3)6-5-7-13(15)16/h8,15H,5-7H2,1-4H3
charge 0 multiplicity 1
38 atoms
O  0.005731 -2.313304 0.004364
O  3.195744 2.340156 -0.032319
O  -5.955195 -0.048752 -0.258957
O  -4.490523 0.891667 -1.793359
C  -1.173585 0.083036 1.05938
C  0.259814 0.051538 0.553542
C  -2.198029 0.173982 -0.103582
C  0.820975 -1.137877 0.028771
C  2.128354 -1.171332 -0.530759
C  2.916679 0.011955 -0.53784
C  1.04793 1.226063 0.535861
C  2.35813 1.204558 0.005312
C  -3.648371 0.135771 0.416362
C  2.663623 -2.454213 -1.140537
C  4.316332 0.018262 -1.124238
C  -4.677517 0.374877 -0.670638
C  0.261171 -3.235998 1.125063
C  2.663903 3.592612 0.501752
H  -1.31097 0.947998 1.738502
H  -1.393465 -0.830772 1.644035
H  -2.033538 1.101255 -0.681836
H  -2.026177 -0.669587 -0.795715
H  0.619706 2.149767 0.937772
H  -3.877856 -0.826584 0.909861
H  -3.804642 0.917957 1.188758
H  3.434828 -2.924427 -0.498551
H  1.847118 -3.178235 -1.291278
H  3.139366 -2.260486 -2.118682
H  4.917968 -0.82515 -0.738111
H  4.289139 -0.082566 -2.227278
H  4.833824 0.95915 -0.885827
H  -0.431876 -4.080789 0.985575
H  0.065279 -2.743894 2.098796
H  1.30603 -3.60342 1.113613
H  1.76706 3.922666 -0.058578
H  3.471844 4.328158 0.371996
H  2.413508 3.500793 1.577214
H  -6.609009 0.147166 -0.984548
