program: Gaussian 09
title: 000269537
version: EM64L-G09RevD.01
frameworkgroup: C1[X(C11H16ClNO)]
method: RPBEPBE
basis: SDD
operation: Freq
keyword: #p
keyword: freq=noraman
keyword: PBEPBE/SDD
title: #p freq=noraman PBEPBE/SDD
converged: YES YES NO NO
title: Mulliken charges:
elementType: Cl O N C C C C C C C C C C C H H H H H H H H H H H H H H H H
charge: -0.066475 -0.438475 -0.356281 0.302825 -0.383557 -0.727547 -0.758371 -0.513184 0.461588 -0.435471 -0.374453 -0.206322 -0.210129 -0.104589 0.251705 0.213357 0.207733 0.237863 0.227208 0.198420 0.205639 0.224521 0.246322 0.205100 0.231579 0.237199 0.276528 0.340361 0.253898 0.253010
chargesum: 0.00000
title: Mulliken charges with hydrogens summed into heavy atoms:
elementType: Cl O N C C C C C C C C C C C
charge: -0.066475 -0.098114 -0.104576 0.302825 0.037533 -0.064058 -0.081890 -0.076505 0.461588 -0.198271 -0.097925 0.047576 0.042880 -0.104589
polarizability: 2.02238702e+02 1.47676317e+00 1.26955066e+02 5.11179606e+00 -1.32140434e+00 8.77290162e+01
1716.lowfreq: -15.6821 -6.7981 -0.0028 -0.0020 -0.0013 3.9565 21.0142 32.6150 50.6514
frequency: 17.1509 32.6111 50.6419 105.3778 114.7083 139.3989 177.6837 217.5620 230.0838 244.5559 258.4139 289.7745 301.2673 322.2324 345.6889 372.0048 397.3830 412.0219 427.4966 462.7967 495.3568 547.2930 606.1132 628.5757 648.7574 706.7111 742.6832 801.3422 825.1104 838.4056 886.5208 900.2541 939.0409 945.8334 964.7333 971.1385 978.3656 997.5827 999.5141 1020.3100 1069.1889 1091.1714 1107.2651 1125.2351 1173.4887 1192.5241 1209.4325 1210.4404 1232.0849 1269.3234 1289.2108 1327.3478 1333.6403 1361.2657 1371.2315 1383.7563 1388.8016 1399.2513 1447.1619 1455.8970 1465.1972 1469.0247 1474.9320 1480.2858 1488.2835 1494.9064 1588.6596 1600.2972 2882.8350 2956.4555 2973.5302 2977.5406 3001.2755 3059.6966 3065.3410 3071.5670 3090.6386 3102.3153 3123.6781 3148.4696 3166.9956 3170.3084 3453.6995 3569.4742
redmass: 5.3058 3.5442 5.9300 3.1202 3.2978 4.6229 3.2298 1.3719 3.9250 1.9306 1.2853 3.0731 1.2948 2.5724 2.3189 2.7642 6.8232 2.9119 2.7012 2.6639 2.6294 3.4026 1.6469 4.0669 4.9650 3.6270 3.7727 2.6577 1.6970 1.2784 2.2345 1.5634 1.3431 1.3556 2.0678 2.6092 1.4863 1.7592 2.9778 1.6313 2.6666 2.1567 1.5394 1.4896 1.1219 1.9886 2.9882 1.3895 3.0362 1.8240 1.3381 1.2255 1.8194 1.1961 1.2701 5.1978 1.2327 2.1106 1.1659 1.0745 1.0688 1.5002 1.3799 1.1017 1.1116 1.0846 7.3873 6.2034 1.0711 1.0643 1.0374 1.0387 1.0852 1.0982 1.0978 1.0953 1.0994 1.1004 1.0897 1.0883 1.0954 1.0967 1.0746 1.0662
irintensity: 0.5422 0.3689 0.5745 3.5290 1.8180 1.4808 2.8293 0.2768 2.3145 20.3011 0.3663 10.4198 107.7946 12.5099 18.6035 10.5697 6.4538 0.2994 9.3128 10.9546 23.5957 4.5566 94.4622 12.7004 17.2104 1.6229 1.3651 22.8816 46.3754 10.8868 2.0225 23.4888 6.9297 2.5516 14.4842 104.4770 6.4417 4.8370 37.3434 4.8259 28.8486 14.5401 2.2789 41.6455 7.2954 60.6781 25.7630 3.8131 15.4619 11.9120 11.6701 20.4067 2.5572 5.7812 31.1132 2.8537 25.6469 11.6086 19.7898 2.5371 3.7503 33.8460 75.3077 9.5566 6.8177 6.7455 2.4704 4.2033 61.4003 68.9315 41.7874 2.6953 18.7469 9.8110 45.3353 51.6153 13.7245 27.5909 12.0128 0.5717 8.3319 1.7040 0.3424 7.7540
temp: 298.150 k
press: 1.00000 atm
elementType: 17 8 7 6 6 6 6 6 6 6 6 6 6 6 1 1 1 1 1 1 1 1 1 1 1 1 1 1 1 1
symmnumber: 1
zpe: 650024.6 jmol-1
zpe.correction: 0.247581 hartree
zpe.thermalcorrener: 0.262860 hartree
zpe.thermalcorrenthalpy: 0.263804 hartree
zpe.thermalcorrgfe: 0.203656 hartree
zpe.sumelectzpe: -1017.706682 hartree
zpe.sumelectthermal: -1017.691404 hartree
zpe.sumelectthermalent: -1017.690459 hartree
zpe.sumelectthermalfe: -1017.750607 hartree
dipole: 1.6985 0.7869 1.0206
dipole: 2.1321
quadrupole: -114.3889 -86.1227 -91.1052
quadrupole: -3.3282 7.7484 0.9268
quadrupole: -17.1833 11.0829 6.1004 -3.3282 7.7484 0.9268
hfenergy: -1017.9542636 hartree
pointgroup: C01[X(C11H16Cl1N1O1)]
dipole: 0.6614379 0.0932176 0.5073838 debye
polarizability: 202.1309468|-0.0824756|119.3104986|6.1530867|15.6563261|95.4813385 unknown
InChI: InChI=1S/C11H16ClNO/c1-11(2,8-14)13-7-9-3-5-10(12)6-4-9/h3-6,13-14H,7-8H2,1-2H3
charge 0 multiplicity 1
30 atoms
Cl -5.513037 -0.405836 -0.335285
O  4.998173 0.830992 0.303402
N  1.357152 -0.111222 -0.464924
C  2.809987 -0.353422 -0.226808
C  3.560079 0.994773 0.031036
C  3.377509 -1.016202 -1.501909
C  2.998537 -1.305447 0.981073
C  0.523983 0.515922 0.579783
C  -0.966319 0.298655 0.319089
C  -1.910514 1.291101 0.680794
C  -1.433718 -0.908537 -0.258392
C  -3.296332 1.086189 0.489986
C  -2.813559 -1.131563 -0.460474
C  -3.725095 -0.128166 -0.077824
H  1.181177 0.287656 -1.396128
H  3.523856 1.620853 -0.878244
H  3.069045 1.544911 0.8624
H  4.476498 -1.08786 -1.433063
H  2.950657 -2.025004 -1.639005
H  3.135551 -0.414157 -2.399882
H  2.773115 -0.81628 1.948515
H  4.037503 -1.679161 1.019967
H  2.328387 -2.175308 0.870954
H  0.699851 1.609925 0.715035
H  0.787497 0.042234 1.545854
H  -1.568051 2.237862 1.116541
H  -0.698098 -1.662563 -0.556236
H  5.109885 0.421291 1.197801
H  -4.02248 1.854793 0.77013
H  -3.173035 -2.06423 -0.905388
