program: Gaussian 09
title: 000269538
version: EM64L-G09RevD.01
frameworkgroup: C1[X(C11H13Cl2NO)]
method: RPBEPBE
basis: SDD
operation: Freq
keyword: #p
keyword: freq=noraman
keyword: PBEPBE/SDD
title: #p freq=noraman PBEPBE/SDD
converged: YES YES NO NO
title: Mulliken charges:
elementType: Cl Cl O N C C C C C C C C C C C H H H H H H H H H H H H H
charge: -0.045554 -0.031499 -0.440293 -0.108011 0.175947 -0.327779 -0.680011 -0.745460 -0.335095 0.535648 -0.281653 -0.343265 -0.217530 -0.218695 -0.091568 0.191131 0.202236 0.211713 0.217206 0.248650 0.228087 0.232426 0.217376 0.240923 0.345111 0.271440 0.284596 0.263926
chargesum: 0.00000
title: Mulliken charges with hydrogens summed into heavy atoms:
elementType: Cl Cl O N C C C C C C C C C C C
charge: -0.045554 -0.031499 -0.095182 -0.108011 0.175947 0.065587 -0.002442 -0.067571 -0.094172 0.535648 -0.281653 -0.071825 0.067066 0.045231 -0.091568
polarizability: 2.45726559e+02 9.40648867e+00 1.56438531e+02 1.71228198e+00 -2.81566594e+00 8.06742696e+01
1716.lowfreq: -14.4315 -2.4811 -0.0028 -0.0015 0.0014 5.1698 14.3712 48.2739 63.6207
frequency: 7.1789 48.2703 63.5937 98.2587 113.9448 159.3012 167.6601 168.8181 194.0766 213.3192 222.4591 247.4136 265.6814 325.5983 333.2847 348.0602 369.5580 393.8742 435.8107 448.6989 485.8115 504.5364 554.8828 560.7022 592.7391 647.2061 711.6546 715.9788 776.2288 835.1262 848.3005 867.6278 867.9489 894.4642 931.1605 962.8576 976.3341 990.2568 1002.6982 1018.8638 1024.0763 1080.8749 1127.8815 1140.3258 1188.4976 1210.0810 1219.9637 1232.8852 1263.9486 1314.0113 1339.9837 1369.6159 1374.1712 1383.1834 1389.8577 1403.0228 1454.6653 1456.8167 1461.4391 1473.3500 1482.5381 1483.6134 1557.4767 1590.1360 1617.3552 2945.4415 2978.3015 2986.9012 3029.3948 3062.6342 3074.0698 3078.5836 3086.1846 3102.8420 3159.1436 3180.6849 3185.7280 3420.4432
redmass: 4.7575 5.6234 6.8326 3.0108 5.5403 4.5361 4.6467 9.0029 2.3979 1.6345 3.7632 1.1725 2.0708 2.5922 3.6256 3.4943 8.4831 4.8204 3.2233 3.7786 4.0048 3.3372 3.3744 2.6823 1.6175 6.7341 6.7199 3.8438 4.6069 1.3563 4.2656 2.6940 1.4087 2.1681 1.4088 1.3836 1.4409 1.7118 2.6938 1.7722 2.9480 2.4866 1.4610 1.3678 3.0195 2.1774 2.1035 1.7172 1.7226 1.3234 2.1309 1.9407 1.2712 1.2770 3.5726 1.2785 2.7063 1.0597 1.0549 1.0849 1.0581 1.0542 8.5323 7.1325 7.4584 1.0679 1.0361 1.0353 1.0869 1.0957 1.0998 1.0995 1.0995 1.0999 1.0884 1.0965 1.0939 1.0638
irintensity: 1.7275 0.0591 2.2088 5.5192 4.3303 0.1395 0.6747 0.4761 0.0281 0.1348 0.1980 0.2589 1.8895 3.9640 2.1795 7.8852 4.2898 10.2368 9.3907 8.2830 3.9569 15.1785 2.2301 43.1716 115.6660 3.0120 43.5587 0.4195 7.4964 38.3802 47.8763 1.5704 19.2377 6.7874 0.5526 4.4221 2.5950 23.4217 78.0511 3.4221 35.4160 41.4715 48.5660 19.0072 29.8718 15.8319 5.5344 18.2139 15.1975 13.5042 20.3083 36.9335 20.6609 23.8245 10.1248 57.5848 82.3938 3.7237 0.3044 3.6522 7.0430 21.3599 29.8788 125.1140 47.0071 82.7302 18.9458 26.1508 20.9719 28.6153 23.8362 18.9760 67.9644 14.1559 0.3635 2.1078 0.9023 73.6278
temp: 298.150 k
press: 1.00000 atm
elementType: 17 17 8 7 6 6 6 6 6 6 6 6 6 6 6 1 1 1 1 1 1 1 1 1 1 1 1 1
symmnumber: 1
zpe: 564041.4 jmol-1
zpe.correction: 0.214832 hartree
zpe.thermalcorrener: 0.230717 hartree
zpe.thermalcorrenthalpy: 0.231661 hartree
zpe.thermalcorrgfe: 0.169322 hartree
zpe.sumelectzpe: -1475.921345 hartree
zpe.sumelectthermal: -1475.905460 hartree
zpe.sumelectthermalent: -1475.904515 hartree
zpe.sumelectthermalfe: -1475.966854 hartree
dipole: 0.1254 2.1597 0.3073
dipole: 2.1850
quadrupole: -106.8383 -108.1738 -105.0594
quadrupole: 12.5527 1.0000 -1.6176
quadrupole: -0.1478 -1.4833 1.6311 12.5527 1.0000 -1.6176
hfenergy: -1476.1361768 hartree
pointgroup: C01 [X(C11H13Cl2N1O1)]
dipole: -0.0506481 -0.7486117 0.4195362 debye
polarizability: 245.7036128|9.4079855|148.5495655|-1.9225025|-23.3710793|88.586181 unknown
InChI: InChI=1S/C11H13Cl2NO/c1-11(2,7-15)14-6-8-3-4-9(12)5-10(8)13/h3-6,15H,7H2,1-2H3
charge 0 multiplicity 1
28 atoms
Cl 1.493913 -2.792582 1.058901
Cl 5.253124 1.05058 -0.224711
O  -3.296462 1.942427 -1.251831
N  -1.590525 0.249553 -0.018318
C  -3.035714 -0.117302 0.124767
C  -3.716104 0.552762 -1.114109
C  -3.540326 0.5594 1.42844
C  -3.34148 -1.631377 0.136174
C  -0.635902 -0.577708 0.301695
C  0.78934 -0.196457 0.177649
C  1.847455 -1.090859 0.485989
C  1.157608 1.108123 -0.260448
C  3.205192 -0.73543 0.371405
C  2.50079 1.501295 -0.38762
C  3.509103 0.566678 -0.068106
H  -3.462011 -0.032713 -2.024902
H  -4.812659 0.563637 -0.987248
H  -4.615082 0.343608 1.56935
H  -2.987538 0.180611 2.306671
H  -3.410488 1.653039 1.367281
H  -2.882472 -2.144777 -0.729327
H  -4.434246 -1.78551 0.082205
H  -2.987359 -2.121013 1.061764
H  -0.825264 -1.597898 0.67935
H  -2.319725 1.925794 -1.040122
H  0.347067 1.804538 -0.495151
H  3.995206 -1.44917 0.6157
H  2.763861 2.50715 -0.725249
