program: Gaussian 09
title: 000269595
version: EM64L-G09RevD.01
frameworkgroup: C1[X(C10H20Cl2N6O4)]
method: RPBEPBE
basis: SDD
operation: Freq
keyword: #p
keyword: freq=noraman
keyword: PBEPBE/SDD
title: #p freq=noraman PBEPBE/SDD
converged: YES YES NO NO
title: Mulliken charges:
elementType: Cl Cl O O O O N N N N N N C C C C C C C C C C H H H H H H H H H H H H H H H H H H H H
charge: -0.072962 -0.097415 -0.212886 -0.242368 -0.386971 -0.321028 -0.020845 -0.371451 -0.413726 0.119655 -0.388219 -0.416306 -0.376484 -0.332053 -0.405812 -0.441839 0.366342 0.272932 -0.325526 -0.343067 -0.555839 -0.539977 0.247489 0.263885 0.287779 0.254422 0.267842 0.261317 0.263205 0.227757 0.305980 0.357056 0.307893 0.349978 0.266187 0.252613 0.237619 0.262606 0.272719 0.276661 0.280053 0.262782
chargesum: 0.00000
title: Mulliken charges with hydrogens summed into heavy atoms:
elementType: Cl Cl O O O O N N N N N N C C C C C C C C C C
charge: -0.072962 -0.097415 -0.212886 -0.242368 -0.386971 -0.321028 -0.020845 -0.065472 -0.056669 0.119655 -0.080325 -0.066328 0.134890 0.210148 0.123347 0.049124 0.366342 0.272932 0.193274 0.157158 -0.006459 0.002858
polarizability: 2.34752264e+02 -4.41417523e-01 1.77135838e+02 -1.16651931e+01 -1.98962345e+01 1.53572845e+02
1716.lowfreq: -12.0313 -4.7768 -0.0016 0.0003 0.0008 5.7993 8.1306 11.9797 24.9190
frequency: -11.2717 11.4786 24.5098 29.2644 36.3138 53.9407 67.3047 78.7478 84.6283 87.6490 90.0594 108.8991 111.0183 117.6702 131.8556 163.7882 187.7672 213.5154 223.1054 251.4773 270.1717 288.5093 298.6471 320.4119 346.3771 350.4286 390.9605 398.8760 427.7619 455.6812 481.3554 508.3790 527.1646 563.7076 584.6965 590.9958 598.0712 602.2838 640.6891 669.8258 671.9393 680.1787 713.7493 717.9547 741.9064 773.3392 789.1172 830.9375 839.3859 871.3863 916.4714 937.4837 950.8000 969.1664 984.8067 990.6571 1008.8465 1028.5632 1030.4826 1081.9190 1087.3588 1097.1478 1128.1541 1154.2261 1156.2547 1169.5848 1190.8305 1197.1900 1211.9413 1226.1971 1235.2850 1240.9805 1257.0002 1260.0837 1284.2721 1299.2301 1303.6398 1304.9648 1315.6342 1328.3733 1351.1441 1367.6215 1368.2530 1368.9874 1371.6553 1394.8206 1431.1967 1438.2934 1441.0434 1444.4418 1450.4448 1457.9237 1466.7695 1478.0448 1483.4248 1508.0739 1536.5206 1549.8066 1598.8738 1650.0042 2994.8477 2998.3330 3000.2601 3009.3917 3030.1025 3047.8158 3052.8323 3057.8331 3058.6470 3061.9052 3069.3188 3071.8304 3094.7076 3120.3353 3149.9057 3155.5591 3376.4943 3472.5929 3539.4242 3560.2425
redmass: 11.7145 10.8540 5.3622 7.6750 6.0160 5.7294 7.7613 7.4866 5.5289 6.4380 5.1259 5.1978 5.8411 4.7637 5.1471 3.6016 6.5263 4.9998 4.4770 5.2200 2.7380 2.3085 3.0629 3.5718 2.5680 2.8680 2.4373 1.7137 3.0865 2.7000 3.0370 3.4378 4.2468 3.3201 1.5876 3.0224 1.7968 2.1315 4.4933 3.3000 8.5214 2.5508 9.1382 8.5732 1.4429 2.7129 1.4007 2.0287 1.9449 2.3369 2.7020 2.5147 2.2786 2.3868 2.4773 2.7963 3.1222 2.1012 1.6632 2.5837 3.7198 3.6436 2.4988 1.4139 1.4649 4.4143 2.1263 2.6323 2.6634 1.2629 1.2060 1.2831 1.9404 1.6018 1.4649 1.2547 1.1630 1.2216 1.2212 1.2189 1.3648 1.3336 1.3150 1.2860 1.2724 5.4926 1.1153 1.1019 1.1103 1.1403 1.3148 1.1376 1.1465 1.2177 1.0976 1.6794 2.5552 2.0253 4.0911 3.0072 1.0591 1.0612 1.0603 1.0610 1.0598 1.0617 1.0853 1.0881 1.1010 1.0738 1.0690 1.1040 1.1031 1.1035 1.1117 1.1120 1.0826 1.0795 1.0775 1.0780
irintensity: 0.6153 1.0293 0.0500 5.6552 1.2603 2.9915 1.9548 3.9318 1.6135 7.9540 7.3876 6.2761 3.1846 27.5797 1.5357 3.5291 2.4492 4.2252 2.5827 3.5192 5.0005 5.7099 3.0039 5.3854 26.6507 27.4900 4.7249 5.9805 6.9013 9.6320 8.3722 8.6169 24.9975 5.2745 153.8682 32.3207 42.6517 35.3439 8.5947 6.3525 10.9689 20.1703 19.8014 13.3304 169.0801 74.7972 44.8358 16.9054 12.5023 23.7061 13.8835 0.7021 23.0490 11.6699 26.4570 12.8711 1.0656 2.5655 0.5704 7.1496 15.7841 7.7063 4.6937 1.2306 11.7850 323.7513 38.1668 67.1319 15.3655 22.2730 12.1781 10.9133 246.1655 138.8282 4.1620 42.0201 60.5848 18.3790 14.1441 2.3571 17.4088 1.8775 5.2423 15.5899 5.9305 163.5326 26.7473 11.3103 11.2456 0.4211 109.1727 13.4153 33.4975 26.2645 17.7893 101.2216 466.9470 533.0068 361.7348 151.5650 43.5995 42.4528 4.9000 31.2551 5.1026 19.4724 9.6627 4.4979 19.1145 21.4930 19.9858 13.8915 1.9375 6.9314 19.0143 13.2480 294.8052 202.4386 39.8619 26.9408
temp: 298.150 k
press: 1.00000 atm
elementType: 17 17 8 8 8 8 7 7 7 7 7 7 6 6 6 6 6 6 6 6 6 6 1 1 1 1 1 1 1 1 1 1 1 1 1 1 1 1 1 1 1 1
symmnumber: 1
zpe: 869955.2 jmol-1
zpe.correction: 0.331348 hartree
zpe.thermalcorrener: 0.355087 hartree
zpe.thermalcorrenthalpy: 0.356032 hartree
zpe.thermalcorrgfe: 0.273805 hartree
zpe.sumelectzpe: -1940.805597 hartree
zpe.sumelectthermal: -1940.781858 hartree
zpe.sumelectthermalent: -1940.780914 hartree
zpe.sumelectthermalfe: -1940.863140 hartree
dipole: -6.7317 0.4411 -1.9758
dipole: 7.0295
quadrupole: -172.2436 -151.5045 -144.0738
quadrupole: 7.3888 -1.2395 10.3155
quadrupole: -16.3030 4.4362 11.8668 7.3888 -1.2395 10.3155
hfenergy: -1941.1369452 hartree
pointgroup: C01 [X(C10H20Cl2N6O4)]
dipole: -1.5634097 1.9302021 -1.2160065 debye
polarizability: 210.3177517|-28.5162241|205.2910718|-10.6316714|-14.975947|149.8521229 unknown
InChI: InChI=1S/C10H20Cl2N6O4/c11-1-3-13-9(19)15-5-7-17(18(21)22)8-6-16-10(20)14-4-2-12/h13-16H,1-8H2
charge 0 multiplicity 1
42 atoms
Cl -5.553747 3.517734 -0.986008
Cl 1.1513 3.268734 2.120754
O  0.993112 -4.659029 1.705369
O  -1.128095 -3.849777 2.098553
O  -0.787383 1.162107 -0.866577
O  3.663614 -0.352486 -0.408575
N  0.157701 -2.956132 0.391775
N  -1.958603 0.176229 0.897319
N  1.470904 -0.571594 -1.221948
N  0.001897 -3.867345 1.4551
N  -2.806119 2.097578 -0.166959
N  2.184374 1.478029 -0.366851
C  -0.9486 -2.010119 0.179917
C  1.511789 -2.906294 -0.225193
C  -0.903885 -0.810501 1.172128
C  1.608446 -2.003675 -1.477158
C  -1.803449 1.145394 -0.080182
C  2.516786 0.151465 -0.650799
C  -2.764888 3.176748 -1.157008
C  3.127078 2.360978 0.307718
C  -4.006236 3.203624 -2.046817
C  2.869552 2.503215 1.811665
H  -0.892469 -1.644729 -0.856204
H  -1.897846 -2.557559 0.303488
H  2.251816 -2.559342 0.520662
H  1.792288 -3.939465 -0.498648
H  -1.039179 -1.188851 2.199027
H  0.080294 -0.316399 1.104543
H  2.6160 -2.190299 -1.891366
H  0.87128 -2.30768 -2.242446
H  -2.791656 0.172338 1.486365
H  0.561154 -0.097983 -1.319445
H  -3.594504 2.096128 0.483697
H  1.215787 1.78694 -0.507114
H  -1.871117 3.002181 -1.784537
H  -2.641179 4.1567 -0.657752
H  3.124182 3.359176 -0.167948
H  4.134906 1.919021 0.182641
H  -3.978436 4.033873 -2.767495
H  -4.190675 2.242419 -2.547388
H  2.846525 1.530907 2.324279
H  3.578086 3.193342 2.294819
