program: Gaussian 09
title: 000269530
version: EM64L-G09RevD.01
frameworkgroup: C1[X(C10H12NO8P)]
method: RPBEPBE
basis: SDD
operation: Freq
keyword: #p
keyword: freq=noraman
keyword: PBEPBE/SDD
title: #p freq=noraman PBEPBE/SDD
converged: YES YES NO NO
title: Mulliken charges:
elementType: P O O O O O O O O N C C C C C C C C C C H H H H H H H H H H H H
charge: 1.403252 -0.440600 -0.455736 -0.546367 -0.177231 -0.196390 -0.530647 -0.192239 -0.177277 0.111525 0.262702 -0.380707 -0.352602 -0.391971 -0.695533 0.228286 0.205772 -0.309642 -0.243653 -0.135766 0.289350 0.226800 0.228389 0.280987 0.215077 0.242828 0.227698 0.245571 0.233164 0.284908 0.266021 0.274032
chargesum: 0.00000
title: Mulliken charges with hydrogens summed into heavy atoms:
elementType: P O O O O O O O O N C C C C C C C C C C
charge: 1.403252 -0.440600 -0.455736 -0.546367 -0.177231 -0.196390 -0.530647 -0.192239 -0.177277 0.111525 0.262702 0.135443 0.156773 0.065935 0.010899 0.228286 0.205772 -0.024734 0.022368 0.138266
polarizability: 2.04084751e+02 2.00540223e+01 1.45771968e+02 3.13001723e+00 1.08951909e+01 1.47491869e+02
1716.lowfreq: -3.4814 -0.0001 0.0012 0.0016 4.6723 6.2913 15.1029 22.8450 39.5228
frequency: 14.9237 22.8289 39.5221 58.0976 62.9086 69.7553 82.3442 97.3317 123.2923 161.6376 169.3595 180.8582 190.4668 218.5660 248.7788 260.7810 274.0542 291.0736 303.6624 338.1772 362.1899 387.1073 395.5011 431.3648 466.2665 504.7602 517.9416 558.1782 584.5370 589.6020 600.2296 651.1694 666.8667 687.5954 712.0832 734.5558 762.1777 764.9353 775.1234 848.5528 851.6278 869.3173 877.5989 901.5078 910.0214 923.7353 932.1115 961.2194 996.3308 1031.9734 1048.4434 1054.0740 1057.5801 1085.6582 1109.7602 1136.6813 1144.3315 1195.6707 1210.7197 1215.3477 1240.3134 1251.8715 1257.1642 1313.2988 1330.2458 1351.2956 1370.1416 1374.3183 1404.0073 1412.8490 1437.1543 1439.7295 1451.0148 1467.2344 1482.3312 1484.5426 1539.8816 1674.4157 2994.5279 2996.1900 3010.4177 3021.7396 3050.6508 3091.5697 3096.9555 3121.5877 3130.7586 3230.7372 3249.1835 3270.0860
redmass: 6.6484 6.3916 6.6340 7.2159 6.9736 2.4916 6.8558 7.0383 10.0820 5.5847 4.6424 6.7491 1.4721 9.3120 5.9989 4.0106 4.3705 4.6141 2.8479 5.7169 2.6670 10.8372 7.0018 4.5103 8.2507 4.8464 5.3192 5.0357 6.2617 3.1003 8.6266 12.6684 6.2594 6.1719 7.5377 12.8731 11.7951 1.2435 1.4008 1.3288 2.5745 6.7281 5.5333 1.7823 1.3883 6.8374 4.0134 3.8909 2.7296 1.6241 1.7090 2.7186 2.3490 3.4700 16.2636 2.1714 1.7802 2.1045 1.6393 6.6652 1.2860 6.3560 1.2226 1.2954 1.3376 1.2714 2.6341 1.2703 1.9458 1.6225 1.2842 1.1043 5.1662 1.1106 1.0608 1.0438 6.3297 12.2644 1.0591 1.0376 1.0664 1.0637 1.1015 1.0995 1.1009 1.1017 1.0979 1.0918 1.0997 1.1091
irintensity: 2.4637 1.3283 0.8093 0.0930 0.8491 0.2758 0.3413 0.7487 0.2331 0.7211 3.6253 0.1643 1.2471 0.0755 0.5388 6.5042 8.2692 6.5027 2.9762 8.5385 1.9453 110.6387 6.3314 6.9924 20.5125 16.3594 5.2658 2.7656 9.8389 5.2237 14.1926 261.9868 43.0287 94.3312 14.1058 144.2877 20.1505 86.2588 17.5780 11.8333 7.3892 15.1991 135.7071 5.6456 0.3812 51.4551 160.8675 377.9097 71.3186 94.0472 25.2641 51.0796 30.4338 12.1061 163.8045 0.1736 24.9137 10.1466 0.4125 63.4059 1.2616 119.1207 2.2175 0.8731 4.7653 10.1906 6.4270 2.1531 118.9774 31.3147 8.2647 2.8767 115.9032 6.6488 16.8421 13.9637 31.7668 279.2835 16.0267 12.2239 13.9958 31.2318 4.6212 27.7363 24.2768 0.1915 0.0117 1.6857 0.9892 0.0948
temp: 298.150 k
press: 1.00000 atm
elementType: 15 8 8 8 8 8 8 8 8 7 6 6 6 6 6 6 6 6 6 6 1 1 1 1 1 1 1 1 1 1 1 1
symmnumber: 1
zpe: 587779.6 jmol-1
zpe.correction: 0.223873 hartree
zpe.thermalcorrener: 0.243970 hartree
zpe.thermalcorrenthalpy: 0.244914 hartree
zpe.thermalcorrgfe: 0.172327 hartree
zpe.sumelectzpe: -1384.387728 hartree
zpe.sumelectthermal: -1384.367631 hartree
zpe.sumelectthermalent: -1384.366687 hartree
zpe.sumelectthermalfe: -1384.439275 hartree
dipole: 3.7318 9.9371 2.3603
dipole: 10.8740
quadrupole: -114.6861 -130.0235 -127.3950
quadrupole: -0.7347 11.8590 -0.6074
quadrupole: 9.3488 -5.9886 -3.3602 -0.7347 11.8590 -0.6074
hfenergy: -1384.6116014 hartree
pointgroup: C01 [X(C10H12N1O8P1)]
dipole: -1.4396092 3.9951425 -0.5185431 debye
polarizability: 203.8229865|-20.4722851|148.3578919|1.5455919|-11.060996|145.1677102 unknown
InChI: InChI=1S/C10H12NO8P/c1-2-10(11(13)14)6-17-20(15,18-7-10)19-9(12)8-4-3-5-16-8/h3-5H,2,6-7H2,1H3
charge 0 multiplicity 1
32 atoms
P  0.240874 -1.684363 -0.354804
O  1.153701 -1.265994 1.051406
O  1.172478 -0.94656 -1.613978
O  -1.118306 -0.530263 -0.417731
O  4.250019 -0.620718 0.831096
O  4.370219 0.113116 -1.319925
O  -0.082068 -3.20568 -0.545546
O  -4.36939 0.502391 0.896171
O  -2.097917 -1.125203 1.647324
N  3.765148 -0.027723 -0.195499
C  2.366378 0.675909 -0.062969
C  1.626979 0.136829 1.179805
C  1.585974 0.460147 -1.382159
C  2.669966 2.201077 0.085879
C  3.510556 2.594187 1.319662
C  -2.175833 -0.535752 0.555102
C  -3.277323 0.264033 0.031324
C  -3.523788 0.858005 -1.206372
C  -4.812328 1.491682 -1.120543
C  -5.288461 1.254524 0.164621
H  2.293478 0.093294 2.051768
H  0.764842 0.798059 1.391535
H  0.689061 1.107668 -1.371653
H  2.224151 0.696045 -2.24621
H  1.695519 2.726424 0.116598
H  3.184996 2.529094 -0.836675
H  2.99334 2.367535 2.268505
H  4.488697 2.082878 1.333301
H  3.702774 3.680979 1.300298
H  -2.857146 0.817942 -2.064332
H  -5.325232 2.044872 -1.904086
H  -6.198954 1.524568 0.692883
