program: Gaussian 09
title: 000269441
version: EM64L-G09RevD.01
frameworkgroup: C1[X(C7H9Cl)]
method: RPBEPBE
basis: SDD
operation: Freq
keyword: #pfreq=noraman
keyword: PBEPBE/SDD
title: #p freq=noraman PBEPBE/SDD
converged: NO NO NO NO
title: Mulliken charges:
elementType: Cl C C C C C C C H H H H H H H H H
charge: -0.090596 -0.200485 -0.200485 -0.445426 -0.448121 -0.448120 -0.214343 -0.214342 0.257786 0.257785 0.312828 0.223643 0.250311 0.250312 0.223640 0.242805 0.242806
chargesum: 0.00000
title: Mulliken charges with hydrogens summed into heavy atoms:
elementType: Cl C C C C C C C
charge: -0.090596 0.057301 0.057301 -0.132598 0.025833 0.025833 0.028462 0.028464
polarizability: 8.84994760e+01 6.40453579e+00 6.52647586e+01 8.99910639e-05 -1.35089905e-04 7.22072042e+01
1716.lowfreq: -27.3042 -13.3272 -0.0030 -0.0029 0.0027 13.9822 192.2800 216.2222 267.0552
frequency: 192.2607 216.2176 267.0537 344.2843 398.3818 485.0550 654.7239 696.3124 748.4715 782.6099 783.7732 819.2331 832.4240 876.0826 904.0976 928.5757 937.9027 973.9719 1001.9608 1027.1041 1030.2189 1086.2428 1125.5917 1147.2718 1154.1069 1203.0979 1217.9124 1230.8584 1255.9307 1266.3784 1267.4276 1302.7493 1314.5091 1454.3463 1470.2657 1569.3597 3017.2793 3029.4129 3078.3173 3095.9012 3098.3960 3100.4011 3114.0796 3151.6882 3183.4507
redmass: 5.2270 3.2626 2.0709 3.7605 3.3815 2.8846 4.5435 1.7390 2.9926 4.1748 3.5928 1.7198 2.2714 2.4538 2.5006 1.5316 1.5724 2.2376 3.6425 2.0328 1.4102 1.1712 1.1213 2.0967 1.2425 1.2337 1.1466 1.3134 1.4601 1.6329 1.3910 1.4593 1.7292 1.0787 1.0966 5.6014 1.0581 1.0613 1.1054 1.0943 1.0888 1.0997 1.0939 1.0879 1.1094
irintensity: 1.8738 0.7676 0.0361 4.8784 10.0679 0.0876 0.0691 64.0700 27.2082 3.2023 53.6179 17.9237 8.8182 14.2476 6.3670 2.2327 0.0003 3.9182 1.5153 0.0212 0.3357 1.7163 14.7626 0.4822 0.3433 0.5984 3.5234 2.3308 1.6449 27.8213 1.0410 3.6406 13.2417 5.6232 9.3874 2.7648 26.7265 41.9011 1.2127 11.9816 42.5762 26.9661 10.6648 6.7988 19.2979
temp: 298.150 k
press: 1.00000 atm
elementType: 17 6 6 6 6 6 6 6 1 1 1 1 1 1 1 1 1
symmnumber: 1
zpe: 369859.6 jmol-1
zpe.correction: 0.140872 hartree
zpe.thermalcorrener: 0.147404 hartree
zpe.thermalcorrenthalpy: 0.148348 hartree
zpe.thermalcorrgfe: 0.110031 hartree
zpe.sumelectzpe: -731.565653 hartree
zpe.sumelectthermal: -731.559121 hartree
zpe.sumelectthermalent: -731.558177 hartree
zpe.sumelectthermalfe: -731.596494 hartree
dipole: -2.4353 0.0116 0.0000
dipole: 2.4353
quadrupole: -58.0100 -54.6533 -51.9929
quadrupole: 1.1216 0.0000 -0.0001
quadrupole: -3.1246 0.2321 2.8925 1.1216 0.0000 -0.0001
hfenergy: -731.7065253 hartree
pointgroup: C01 [X(C7H9Cl1)]
dipole: 0.9462006 -0.1507809 -0.000316 debye
dipolederiv: -0.8382856 0.0420616 0.000161 -0.0413399 -0.1972287 0.0000039 0.0000888 -0.0000132 -0.1924892 -0.1579171 0.005232 0.0674232 -0.1323015 0.0526267 -0.092301 -0.0037389 -0.0255824 0.1309106 -0.1579429 0.0053605 -0.0672997 -0.132274 0.0524164 0.0922122 0.0036238 0.0254394 0.1311393 1.1542635 -0.0224078 -0.0002321 0.1104815 0.15675 0.0000706 -0.0001178 0.0000962 0.0483293 0.0890073 -0.050655 -0.047798 -0.0235173 0.0259205 0.0392818 -0.0417742 -0.0052945 -0.0364064 0.0890568 -0.0507406 0.0476651 -0.0235928 0.0259842 -0.039162 0.0416809 0.0054312 -0.0365051 0.029378 0.0780345 -0.0267104 0.1016462 -0.2525694 0.0747112 0.0562811 0.0757993 -0.0247315 0.0293699 0.0779623 0.0268202 0.1017154 -0.2522977 -0.0751465 -0.0561246 -0.076226 -0.0249807 0.0660484 0.004172 -0.0542199 0.0072574 0.0447177 0.0650786 -0.0298583 0.0560955 -0.1184142 0.0660809 0.004057 0.0541552 0.0071816 0.0449303 -0.0647911 0.029798 -0.0558088 -0.1186544 -0.0446269 -0.0378347 -0.000011 0.0099243 -0.1008866 -0.0001498 0.0000299 -0.0001403 0.0690476 -0.0208975 0.1176209 0.0898963 0.0812113 -0.0248397 -0.0525553 0.0477215 -0.0577819 0.0112755 -0.0717469 -0.0972777 -0.1037755 -0.0664002 0.037722 -0.0478421 -0.0417906 -0.0181746 0.0411618 -0.0716796 -0.0974563 0.1036497 -0.0664655 0.0375889 0.0478735 0.0417187 0.0182134 0.0412181 -0.0209736 0.1178041 -0.0896803 0.0813148 -0.0250219 0.0524479 -0.0475651 0.0576608 0.0115285 -0.0695357 -0.0480354 0.0816667 -0.0074939 0.187084 -0.0009527 0.083112 0.012536 0.0337631 -0.069599 -0.0478975 -0.0817103 -0.0073473 0.1871033 0.001221 -0.0830851 -0.0122501 0.0338077 unknown
polarizability: 89.8905084|2.6005496|63.8737329|-0.0010433|-0.0077843|72.2071976 unknown
InChI: InChI=1S/C7H9Cl/c8-7-5-1-2-6(7)4-3-5/h1-2,5-7H,3-4H2
charge 0 multiplicity 1
17 atoms
Cl -2.49191 0.62962 0.001054
C  0.133537 0.155713 -1.146595
C  0.133983 0.153723 1.14687
C  -0.615154 0.89633 0.000927
C  -0.14836 -1.353421 -0.785988
C  -0.148031 -1.354799 0.783728
C  1.562001 0.465339 -0.684833
C  1.562267 0.464143 0.685092
H  -0.127172 0.445034 -2.174466
H  -0.126336 0.441233 2.175348
H  -0.482217 1.98777 0.00185
H  0.622891 -2.012997 -1.217689
H  -1.133198 -1.657465 -1.180414
H  -1.132677 -1.659606 1.178038
H  0.623454 -2.015083 1.213928
H  2.4197 0.595462 -1.351206
H  2.420226 0.593103 1.351355
