program: Gaussian 09
title: 000269439
version: EM64L-G09RevD.01
frameworkgroup: C1[X(C7H9Br)]
method: RPBEPBE
basis: SDD
operation: Freq
keyword: #pfreq=noraman
keyword: PBEPBE/SDD
title: #p freq=noraman PBEPBE/SDD
converged: YES YES NO YES
title: Mulliken charges:
elementType: Br C C C C C C C H H H H H H H H H
charge: -0.029144 -0.196808 -0.196807 -0.487379 -0.464857 -0.464861 -0.193851 -0.193853 0.261094 0.261095 0.286615 0.233752 0.236192 0.236193 0.233752 0.239434 0.239434
chargesum: 0.00000
title: Mulliken charges with hydrogens summed into heavy atoms:
elementType: Br C C C C C C C
charge: -0.029144 0.064286 0.064288 -0.200763 0.005087 0.005084 0.045582 0.045580
polarizability: 9.94933125e+01 -6.90708361e+00 7.03586329e+01 -6.07993748e-03 -2.44243654e-03 7.31551313e+01
1716.lowfreq: -9.5240 -6.9572 -0.0005 -0.0005 0.0002 22.2153 152.9278 188.2586 254.9863
frequency: 152.9270 188.2570 254.9844 266.7793 390.2730 466.0309 672.5842 702.6573 735.1881 777.2499 783.4262 801.5725 846.5181 863.7426 918.6995 929.8240 931.7311 963.1244 971.9243 973.5249 1059.3157 1083.1880 1113.1231 1129.3900 1151.3286 1188.4012 1202.8822 1213.7113 1256.5822 1263.2522 1279.7155 1292.2155 1326.1000 1464.3444 1476.2120 1589.0325 3008.4422 3022.9445 3076.8138 3078.0814 3097.0276 3104.8566 3112.6756 3166.7586 3199.1136
redmass: 5.1344 3.9094 1.8133 5.6243 2.4578 3.0260 4.3032 1.6830 3.0956 3.8921 6.3642 1.4470 2.2346 2.1881 1.4767 2.7088 1.7127 3.5818 2.6488 1.9213 1.4819 1.1372 1.0821 1.1657 1.9194 1.4029 1.2589 1.1518 1.3046 1.4246 1.6269 1.5465 1.8003 1.0788 1.0935 5.8306 1.0605 1.0628 1.1033 1.0883 1.1041 1.0892 1.0937 1.0879 1.1100
irintensity: 0.4180 0.0652 0.0001 5.1617 0.8233 0.0075 1.8407 115.8085 0.6826 2.5099 3.3886 18.4495 7.5726 12.5636 1.3856 6.4684 0.3114 0.1078 2.3557 0.0003 0.1166 3.2593 18.3272 2.2835 1.4223 3.2547 0.1824 37.8621 0.6639 1.9721 5.6705 8.5597 14.4905 3.7997 6.9278 1.1280 28.9479 56.1489 1.4746 9.6407 44.5844 42.9033 13.3229 5.5712 15.7358
temp: 298.150 k
press: 1.00000 atm
elementType: 35 6 6 6 6 6 6 6 1 1 1 1 1 1 1 1 1
symmnumber: 1
zpe: 368130.0 jmol-1
zpe.correction: 0.140213 hartree
zpe.thermalcorrener: 0.147003 hartree
zpe.thermalcorrenthalpy: 0.147947 hartree
zpe.thermalcorrgfe: 0.108162 hartree
zpe.sumelectzpe: -284.960429 hartree
zpe.sumelectthermal: -284.953640 hartree
zpe.sumelectthermalent: -284.952696 hartree
zpe.sumelectthermalfe: -284.992480 hartree
dipole: 3.0723 -0.6220 -0.0001
dipole: 3.1347
quadrupole: -59.4887 -55.1083 -54.9180
quadrupole: -0.4766 -0.0001 -0.0001
quadrupole: -2.9837 1.3967 1.5870 -0.4766 -0.0001 -0.0001
hfenergy: -285.1006424 hartree
pointgroup: C01 [X(C7H9Br1)]
dipole: -1.2307518 -0.0787561 0.0000365 debye
dipolederiv: -0.70344 0.0253576 0.0000175 -0.0505296 -0.1223309 -0.0000127 -0.0000141 0.000005 -0.1681161 -0.1218757 -0.0312501 0.12449 -0.0858088 -0.0102584 -0.0472123 -0.0921641 -0.0489299 0.1373829 -0.1215973 -0.0313924 -0.1244743 -0.0859774 -0.0101377 0.0472735 0.0915769 0.0491909 0.1373421 1.1519459 -0.0398779 -0.0000226 0.1117036 0.1065038 -0.0000363 0.0000161 -0.0000349 0.01596 0.0026726 0.0002714 -0.0437005 0.0558339 0.089696 0.0051319 0.0215729 0.0288324 -0.0412067 0.002667 0.0002793 0.0436691 0.0558491 0.0896697 -0.0051695 -0.0215773 -0.0288998 -0.0412066 -0.2425849 0.0246204 -0.0546729 -0.0243923 0.1126367 0.014158 -0.0220851 -0.0608836 -0.0291647 -0.2426165 0.024648 0.054648 -0.0242893 0.1126338 -0.014191 0.0221028 0.0608092 -0.0291971 0.0537939 0.0052462 -0.072962 0.0045667 0.0531183 0.0449251 -0.0418546 0.0376558 -0.1157172 0.0536456 0.0053219 0.0729719 0.0047107 0.0530442 -0.0449987 0.0424119 -0.0379026 -0.115677 -0.1025569 -0.0621882 0.0000197 -0.0093631 -0.121248 0.0000598 -0.0000067 0.0000444 0.08372 -0.098578 0.0744888 0.0702645 0.0934237 0.0155061 -0.0704217 0.050015 -0.031285 0.019958 0.0507478 -0.0546867 0.0347415 -0.0849209 -0.138601 0.1189428 0.0196191 0.0516473 0.0308391 0.0507492 -0.0546948 -0.0347051 -0.0849474 -0.1386668 -0.1188784 -0.0195826 -0.051573 0.0309146 -0.098637 0.0744846 -0.0702843 0.0934017 0.0155512 0.0704035 -0.050063 0.031289 0.0199191 0.1828336 0.0196855 0.0101765 0.0153902 -0.0535852 -0.076137 0.0115814 -0.0893914 0.0321579 0.1828306 0.0196866 -0.0101771 0.0153492 -0.0535318 0.0761629 -0.0115486 0.0894263 0.0320919 unknown
polarizability: 100.8126182|2.7440276|69.0393272|-0.0056931|0.0032434|73.1551313 unknown
InChI: InChI=1S/C7H9Br/c8-7-5-1-2-6(7)4-3-5/h1-2,5-7H,3-4H2
charge 0 multiplicity 1
17 atoms
Br 2.689531 -0.543619 0.000061
C  -0.080161 -0.091469 1.146123
C  -0.080204 -0.091915 -1.146079
C  0.678738 -0.817151 0.00015
C  -1.542003 -0.595694 0.789118
C  -1.542022 -0.596029 -0.78883
C  -0.012857 1.36689 0.681577
C  -0.012916 1.366628 -0.682095
H  0.24445 -0.306407 2.173188
H  0.244377 -0.307244 -2.173071
H  0.566096 -1.913368 0.000366
H  -2.304328 0.077352 1.213788
H  -1.714887 -1.610086 1.19151
H  -1.714883 -1.610597 -1.190789
H  -2.304375 0.076814 -1.213769
H  -0.045525 2.230708 1.34957
H  -0.045631 2.230187 -1.35042
