program: Gaussian 09
title: 000269444
version: EM64L-G09RevD.01
frameworkgroup: C1[X(C8H11ClO)]
method: RPBEPBE
basis: SDD
operation: Freq
keyword: #p
keyword: freq=noraman
keyword: PBEPBE/SDD
title: #p freq=noraman PBEPBE/SDD
converged: NO YES NO NO
title: Mulliken charges:
elementType: Cl O C C C C C C C C H H H H H H H H H H H
charge: -0.080262 -0.307981 -0.212769 -0.132906 -0.128672 -0.179050 -0.529307 -0.034410 -0.503602 -0.691721 0.277059 0.260818 0.249080 0.250072 0.219151 0.277679 0.264077 0.212003 0.243287 0.276321 0.271131
chargesum: 0.00000
title: Mulliken charges with hydrogens summed into heavy atoms:
elementType: Cl O C C C C C C C C
charge: -0.080262 -0.307981 0.064290 0.127912 0.120408 0.071022 -0.032476 0.229668 -0.048312 -0.144269
polarizability: 1.00903646e+02 -6.19191575e+00 8.41066420e+01 4.02128409e+00 -3.75123960e+00 7.68962500e+01
1716.lowfreq: -34.1523 -11.3081 -0.0029 -0.0024 -0.0018 9.0119 53.8054 122.0096 190.1214
frequency: 53.3556 121.9651 190.1156 272.0479 320.1698 355.2300 413.3943 468.2258 518.0106 557.5491 665.6329 725.1391 756.4270 772.9893 805.6084 814.4118 836.6342 880.4269 906.1322 925.7139 938.7110 957.8637 969.8098 983.9382 994.4502 1040.5362 1062.4537 1085.3371 1113.0037 1127.9623 1148.3711 1168.2445 1186.3927 1206.7862 1242.3595 1247.8478 1264.1778 1270.0400 1280.9024 1298.1731 1305.4728 1345.2852 1353.6084 1453.8308 1459.6355 1475.2645 2992.6391 3016.0881 3038.3462 3051.0594 3064.1765 3084.4933 3101.9999 3125.5573 3130.2776 3135.7345 3157.2778
redmass: 6.5520 4.4680 2.9835 5.0003 2.6892 3.8548 2.8013 2.2711 4.1865 5.1482 5.4883 2.8695 5.1171 4.1951 3.0771 3.8203 1.9930 1.9759 1.9329 2.8034 2.1329 1.8686 1.7340 1.5034 1.5754 1.9440 1.3384 1.4605 1.1177 1.1394 1.6437 2.0667 1.3292 1.4962 1.2884 1.3070 1.6588 1.3897 1.5465 1.4820 1.5039 2.7123 1.4148 1.1005 1.0907 1.0917 1.0628 1.0862 1.0639 1.0575 1.0990 1.0897 1.0907 1.1024 1.1098 1.0902 1.0993
irintensity: 1.7816 2.0049 1.3323 5.9238 3.8296 1.3038 11.8752 2.2405 3.0871 4.0017 43.3706 6.5186 0.3097 1.4855 46.5543 4.3561 10.4109 4.1062 2.6376 4.5558 8.1029 3.3505 6.3022 0.5511 2.9574 2.6645 4.4800 6.0902 0.9629 0.4634 3.7845 0.5893 5.4950 2.4010 3.1191 0.9878 3.5444 1.9225 13.2813 2.0259 21.0632 5.1973 0.5142 9.0820 17.7631 7.0030 36.1111 10.0988 27.9188 18.5863 29.4557 49.9347 15.4826 9.8098 18.6497 14.6573 16.2160
temp: 298.150 k
press: 1.00000 atm
elementType: 17 8 6 6 6 6 6 6 6 6 1 1 1 1 1 1 1 1 1 1 1
symmnumber: 1
zpe: 456000.2 jmol-1
zpe.correction: 0.173681 hartree
zpe.thermalcorrener: 0.182086 hartree
zpe.thermalcorrenthalpy: 0.183031 hartree
zpe.thermalcorrgfe: 0.139627 hartree
zpe.sumelectzpe: -845.907024 hartree
zpe.sumelectthermal: -845.898619 hartree
zpe.sumelectthermalent: -845.897675 hartree
zpe.sumelectthermalfe: -845.941079 hartree
dipole: -0.3667 3.2776 -1.2036
dipole: 3.5108
quadrupole: -78.3159 -68.2584 -62.6992
quadrupole: -4.2087 -0.3290 0.1115
quadrupole: -8.5580 1.4995 7.0586 -4.2087 -0.3290 0.1115
hfenergy: -846.0807056 hartree
pointgroup: C01 [X(C8H11Cl1O1)]
dipole: -0.0509105 1.2836992 0.5073324 debye
dipolederiv: -0.5107857 -0.1937341 -0.0461791 -0.2644256 -0.3613064 -0.0467511 -0.1253091 -0.091153 -0.2280122 -0.5852187 0.2872336 0.0300401 0.2963597 -0.5336233 0.0493739 0.0904764 0.0011515 -0.3471511 -0.0022012 0.0080475 0.039977 0.0012502 -0.0231549 0.0734142 0.0684181 0.0858633 0.0569451 0.2552802 -0.0820219 0.0428558 -0.1454153 0.2132985 -0.102026 -0.0238905 -0.1407171 0.1445847 0.1389818 -0.1565037 -0.0140749 -0.123989 0.2955654 -0.0665986 0.0590371 -0.0258821 0.2357397 0.1196851 0.1011735 0.0099301 0.0332101 0.0165584 0.0178765 -0.0296703 -0.0098771 -0.0434567 -0.0244375 -0.0604332 0.0003761 -0.033889 0.0446798 -0.0390405 0.0194235 -0.034439 0.0040744 -0.0204888 -0.0795688 0.005477 -0.1486711 0.0067054 -0.0284807 -0.090369 -0.1037488 0.0110222 -0.0444115 -0.0486825 -0.0085802 0.0132507 0.0634524 -0.0578349 0.0520586 0.0343478 0.1118134 0.5902767 0.2682691 0.1482996 0.3870443 0.4181382 0.0900118 0.1487921 0.1150717 0.2160808 0.0216123 -0.0483332 -0.0775636 -0.0284758 0.014669 -0.0722067 -0.0727743 -0.0622245 -0.0228944 0.0026489 -0.0602237 0.0151191 -0.0672537 0.0028087 0.0791509 0.0247309 0.0921126 0.0367784 0.1133791 0.0160896 -0.0307167 0.0123982 0.0240691 0.0039674 -0.05753 -0.0021004 -0.1134955 -0.0958236 -0.1251768 -0.0271048 -0.0986374 -0.032836 -0.0229662 -0.0200468 -0.0112035 0.0728029 0.0726235 0.0594564 -0.0670511 0.0291715 -0.0551695 0.1306571 -0.0365301 0.0950295 -0.0149376 -0.0368012 0.0292686 0.0932179 0.0600198 0.0617821 -0.0747051 0.0567338 -0.0343268 0.0434405 -0.0262278 0.0406003 -0.0526502 0.0803864 -0.002778 0.0725897 -0.0478908 0.0838538 -0.0506103 0.0569988 0.0038676 0.0488813 0.0086299 0.0832736 0.0254671 0.0618388 -0.0344952 -0.167125 0.0191621 0.039012 -0.0110516 0.0107381 -0.1681068 0.0191425 -0.0136618 0.0821126 0.0567291 -0.0659524 0.0086248 0.0246734 0.0340114 -0.051997 -0.0951085 0.0210177 -0.0719835 0.0395672 0.0216997 -0.0069652 -0.1238752 -0.0557133 -0.0160287 0.0440671 -0.0848544 0.0326083 -0.0418957 unknown
polarizability: 98.6909046|8.3720508|86.1327084|3.4868521|4.5087003|77.0829245 unknown
InChI: InChI=1S/C8H11ClO/c9-3-5-1-4-2-6(5)8-7(4)10-8/h4-8H,1-3H2
charge 0 multiplicity 1
21 atoms
Cl -3.293389 -1.016731 -0.146348
O  2.003399 -1.428078 0.118732
C  -0.106883 -0.345275 -0.911024
C  0.509098 -1.171243 0.231875
C  1.47882 -0.242742 0.906518
C  1.375848 1.078779 0.119961
C  1.083579 0.572114 -1.324069
C  -1.047431 0.713295 -0.224136
C  -0.020878 1.663815 0.527411
C  -2.104303 0.174655 0.736575
H  -0.595266 -0.921461 -1.709105
H  -0.046173 -1.965726 0.738161
H  1.709584 -0.259721 1.97666
H  2.220717 1.773478 0.239777
H  0.772695 1.386709 -2.000574
H  1.923324 0.01606 -1.763828
H  -1.5627 1.279047 -1.022695
H  -0.167926 1.65241 1.625057
H  -0.131307 2.708881 0.189673
H  -2.752746 0.973082 1.128319
H  -1.67896 -0.409148 1.566956
