program: Gaussian 09
title: 000269446
version: EM64L-G09RevD.01
frameworkgroup: C1[X(C10H16O2)]
method: RPBEPBE
basis: SDD
operation: Freq
keyword: #pfreq=noraman
keyword: PBEPBE/SDD
title: #p freq=noraman PBEPBE/SDD
converged: NO YES NO NO
title: Mulliken charges:
elementType: O O C C C C C C C C C C H H H H H H H H H H H H H H H H
charge: -0.218964 -0.216222 0.331211 -0.097168 -0.118807 -0.525069 -0.508706 -0.477585 -0.754617 -0.763658 -0.480919 0.160689 0.223093 0.242618 0.214513 0.241305 0.248704 0.242021 0.227957 0.215357 0.246572 0.208889 0.218665 0.231777 0.219716 0.218895 0.243108 0.226625
chargesum: 0.00000
title: Mulliken charges with hydrogens summed into heavy atoms:
elementType: O O C C C C C C C C C C
charge: -0.218964 -0.216222 0.331211 0.125925 0.123810 -0.069251 -0.017981 -0.034271 -0.080491 -0.093269 -0.011186 0.160689
polarizability: 1.21464925e+02 -8.00842172e-01 1.00652627e+02 4.61644504e+00 5.35477309e-01 9.59444312e+01
1716.lowfreq: -17.9618 -6.7157 -0.0011 -0.0008 -0.0007 14.3011 73.4918 158.3771 166.2201
frequency: 73.4643 158.3626 166.2110 193.3013 218.1899 236.2589 266.6515 310.1529 323.8366 340.5811 365.9370 405.5333 433.1612 460.0159 493.3773 553.5621 609.7541 660.1236 667.8287 734.6639 777.9225 801.0954 822.2752 872.4235 892.9999 925.5108 931.3789 945.8612 955.9733 972.2935 985.2914 1018.3007 1041.3035 1056.3781 1099.5682 1120.6623 1136.5752 1165.0162 1171.0843 1193.9658 1210.0111 1232.1306 1249.8551 1254.7036 1259.0059 1304.1941 1306.2686 1330.4633 1334.0523 1357.1926 1360.3927 1381.5214 1403.4273 1458.3174 1460.8338 1464.7315 1471.7188 1479.0078 1483.4121 1492.7396 1498.8515 1640.2976 2976.6876 2982.4314 2982.7372 2997.5850 3003.8485 3009.1356 3020.6274 3044.2897 3052.2549 3064.3639 3066.4826 3072.2956 3077.0878 3080.4132 3083.6636 3095.9103
redmass: 6.3519 2.7150 1.2701 2.0692 1.4812 1.6823 2.5826 3.5940 2.5748 3.4281 2.3846 2.2567 3.3376 3.5949 2.3600 4.2158 4.0686 2.9991 3.3110 3.3247 2.1334 2.0611 3.0119 2.5736 2.2700 2.1688 2.2170 1.6211 1.7643 2.4691 1.6078 1.8381 2.2535 2.2430 1.8952 2.0237 1.5777 1.6467 1.6428 1.9195 1.4513 1.4461 1.8745 1.5515 1.5430 1.4909 1.3883 1.5715 1.4562 1.3510 1.2416 1.1973 1.2008 1.0835 1.0629 1.0510 1.0674 1.0681 1.0611 1.0739 1.0681 10.6931 1.0356 1.0388 1.0661 1.0696 1.0645 1.0689 1.0653 1.0985 1.1024 1.0954 1.0966 1.0983 1.0987 1.0978 1.0993 1.0971
irintensity: 1.6181 2.2574 0.6924 0.5392 1.4367 0.7494 0.7018 2.3949 0.2839 2.1779 1.4259 0.9816 0.9908 2.0976 2.0680 4.5910 2.5264 2.1540 5.6330 6.3753 3.4246 8.0796 8.2710 1.2739 12.2890 3.9818 24.4765 24.4016 11.1694 39.3909 21.1228 5.0605 12.4546 58.5109 82.2463 19.2932 9.8400 13.5885 12.8696 38.1863 7.8141 3.0581 1.4472 3.5307 5.7234 3.3997 1.0426 2.0633 0.7346 11.2107 11.9967 12.6729 18.6051 16.6815 5.4697 6.1496 26.4160 3.8021 2.3921 34.9143 8.6132 285.6524 26.1903 24.8900 20.0313 31.1456 5.0129 70.0979 28.2039 27.8943 14.6680 2.1222 1.0866 55.0731 49.4295 35.1533 27.1705 32.8601
temp: 298.150 k
press: 1.00000 atm
elementType: 8 8 6 6 6 6 6 6 6 6 6 6 1 1 1 1 1 1 1 1 1 1 1 1 1 1 1 1
symmnumber: 1
zpe: 637608.3 jmol-1
zpe.correction: 0.242852 hartree
zpe.thermalcorrener: 0.254098 hartree
zpe.thermalcorrenthalpy: 0.255042 hartree
zpe.thermalcorrgfe: 0.207061 hartree
zpe.sumelectzpe: -540.161605 hartree
zpe.sumelectthermal: -540.150360 hartree
zpe.sumelectthermalent: -540.149416 hartree
zpe.sumelectthermalfe: -540.197396 hartree
dipole: -4.7931 2.7293 1.1805
dipole: 5.6406
quadrupole: -85.4568 -72.6971 -71.5317
quadrupole: 7.7850 4.0960 -1.5675
quadrupole: -8.8949 3.8648 5.0302 7.7850 4.0960 -1.5675
hfenergy: -540.4044577 hartree
pointgroup: C01 [X(C10H16O2)]
dipole: 1.9129735 -1.048891 0.4063897 debye
polarizability: 121.33154|-0.2873659|100.6586876|-5.0267219|-0.4976266|96.0717554 unknown
InChI: InChI=1S/C10H16O2/c1-10(2)7-3-5-8(10)12-9(11)6-4-7/h7-8H,3-6H2,1-2H3
charge 0 multiplicity 1
28 atoms
O  -1.020245 0.795332 -1.059191
O  -3.09042 0.708206 -0.141386
C  1.179391 0.657248 0.23951
C  1.01694 -0.754693 0.906705
C  0.438344 0.464814 -1.118113
C  1.250143 -1.745313 -0.277049
C  0.736752 -1.000162 -1.553873
C  -0.366739 -0.982381 1.566107
C  0.658138 1.845975 1.078259
C  2.68207 0.913021 -0.075794
C  -1.575084 -1.06232 0.594611
C  -1.949363 0.20043 -0.188189
H  1.786982 -0.885051 1.69254
H  0.77718 1.197017 -1.869183
H  0.726764 -2.70477 -0.111226
H  2.323525 -1.984246 -0.375653
H  1.500731 -1.001586 -2.351074
H  -0.168566 -1.459464 -1.98779
H  -0.558461 -0.208756 2.332744
H  -0.33171 -1.951089 2.103096
H  -0.425554 1.801385 1.272436
H  1.180502 1.883203 2.053188
H  0.852095 2.799901 0.554197
H  3.127456 0.12098 -0.703403
H  2.809984 1.876322 -0.603774
H  3.262462 0.963302 0.864239
H  -2.481071 -1.327314 1.165125
H  -1.403647 -1.87849 -0.133456
