program: Gaussian 09
title: 000269435
version: EM64L-G09RevD.01
frameworkgroup: C1[X(C10H9NO3)]
method: RPBEPBE
basis: SDD
operation: Freq
keyword: #p
keyword: freq=noraman
keyword: PBEPBE/SDD
title: #p freq=noraman PBEPBE/SDD
converged: YES YES NO NO
title: Mulliken charges:
elementType: O O O N C C C C C C C C C C H H H H H H H H H
charge: -0.293397 -0.256267 -0.187214 0.005443 0.252700 0.209655 0.356857 -0.440336 -0.319616 -0.379562 0.075310 -0.536391 -0.491610 -0.234223 0.266028 0.264581 0.280483 0.233951 0.233971 0.247394 0.239593 0.239821 0.232827
chargesum: 0.00000
title: Mulliken charges with hydrogens summed into heavy atoms:
elementType: O O O N C C C C C C C C C C
charge: -0.293397 -0.256267 -0.187214 0.005443 0.252700 0.209655 0.356857 -0.174307 -0.055035 -0.099078 0.075310 0.178926 0.220631 -0.234223
polarizability: 2.14151727e+02 -4.79380375e+00 1.41508681e+02 -7.98432811e-04 6.20286547e-02 5.83671899e+01
1716.lowfreq: -12.3505 -4.1309 -0.0009 -0.0003 -0.0003 5.8885 9.2210 50.2042 95.7735
frequency: -11.7962 50.1970 95.7722 97.1987 101.1557 168.9060 185.1766 196.0941 208.6480 256.1613 280.5889 299.1612 324.5384 336.0723 384.0828 444.1199 456.8724 510.7191 547.3052 565.7486 609.5627 668.0863 714.1210 723.8252 752.4180 842.8863 859.9664 872.2486 959.8397 974.3109 978.7886 1009.9474 1106.4913 1111.4280 1112.2911 1152.6390 1158.4276 1176.3823 1247.2183 1269.6563 1291.3816 1378.2590 1413.3321 1440.5690 1449.3244 1458.9552 1461.5970 1469.4836 1473.7881 1499.8000 1534.7896 1573.0826 1609.6962 2155.6391 2968.5816 3010.9038 3060.5525 3124.1518 3131.4694 3136.6312 3154.8105 3159.7768 3179.3822
redmass: 3.0701 7.3327 8.2094 3.5062 6.7705 2.3398 5.4959 1.2158 4.3738 1.6212 4.3520 3.2815 5.5724 5.9670 6.1769 7.0589 3.1995 6.2437 5.1668 5.2475 9.2935 7.6631 4.9812 5.2820 3.6653 1.4576 7.4170 1.6397 8.9679 9.2543 1.3492 3.2470 1.2426 1.8731 1.2581 1.3104 1.4169 2.0031 2.4270 1.7548 3.6938 4.0977 2.8533 1.2431 1.4480 1.0522 1.0950 1.0487 1.0997 2.7784 9.5328 8.7194 6.2084 12.7014 1.0325 1.0281 1.1046 1.1054 1.1003 1.1059 1.0899 1.0881 1.0976
irintensity: 3.4669 2.8939 3.0939 7.5475 5.3734 1.3838 2.9099 0.4479 1.1984 1.0641 15.4094 2.1438 2.3251 2.7146 12.8193 3.3257 1.9403 5.9305 1.5053 1.0118 4.9052 10.4775 6.3753 12.8393 26.1809 14.2622 36.1470 40.0301 54.3422 0.3901 0.0956 65.7919 0.0776 114.3493 0.1476 28.2428 29.9523 72.9534 6.7287 177.1538 435.6117 21.1022 77.2108 2.2757 2.1099 14.6484 41.3952 14.1097 76.8918 207.9487 432.0196 0.6036 142.9202 6.9010 40.1873 64.4245 35.6196 28.3023 18.3244 23.4402 1.6218 0.2439 3.5610
temp: 298.150 k
press: 1.00000 atm
elementType: 8 8 8 7 6 6 6 6 6 6 6 6 6 6 1 1 1 1 1 1 1 1 1
symmnumber: 1
zpe: 442289.4 jmol-1
zpe.correction: 0.168459 hartree
zpe.thermalcorrener: 0.181370 hartree
zpe.thermalcorrenthalpy: 0.182314 hartree
zpe.thermalcorrgfe: 0.128921 hartree
zpe.sumelectzpe: -665.816275 hartree
zpe.sumelectthermal: -665.803364 hartree
zpe.sumelectthermalent: -665.802420 hartree
zpe.sumelectthermalfe: -665.855814 hartree
dipole: 6.8007 1.8880 0.0015
dipole: 7.0579
quadrupole: -94.7199 -77.1502 -81.6760
quadrupole: 6.0273 0.0496 -0.0369
quadrupole: -10.2045 7.3651 2.8394 6.0273 0.0496 -0.0369
hfenergy: -665.9847344 hartree
pointgroup: C01 [X(C10H9N1O3)]
dipole: -2.7036667 0.565986 -0.2837715 debye
dipolederiv: -0.5841034 0.4358629 -0.0253093 0.5538042 -1.2943764 0.0366619 -0.0230794 0.0236673 -0.2638877 -2.1434414 -0.1181075 -0.2074249 -0.2696432 -0.2799625 -0.0294812 -0.2085293 -0.0122857 -0.3124089 -1.3292843 0.0164998 -0.1108112 0.6376928 -0.5261413 0.0656693 -0.098268 -0.0022767 -0.3222586 -0.2555652 -0.0159235 -0.004147 -0.0921151 -0.1470715 -0.0086987 -0.0055569 -0.0003413 -0.2209648 0.0334834 -0.7944551 -0.0200242 -1.1552713 0.6519875 -0.1121648 -0.0263126 -0.0724069 0.0409592 1.846401 0.2748254 0.1966784 0.6313021 0.0447041 0.068226 0.2028782 0.028555 0.1393423 -1.2704394 -0.1877751 -0.139712 -0.3278836 -0.1534997 -0.038199 -0.1417556 -0.0226358 -0.0436991 0.3599781 0.2875067 0.0624994 -0.2447179 -0.1016287 -0.0258837 0.0513522 0.0319297 -0.1466035 -0.6113303 -0.0525942 -0.0505253 0.3789048 0.1140543 0.0473088 -0.0422934 -0.0001273 -0.168986 0.3859288 0.0745925 0.0572818 0.3341169 0.0721328 0.0404089 0.0624519 0.0120281 -0.1141649 2.3048198 0.2401152 0.2255215 -0.0989288 0.9006013 0.0007208 0.2182891 0.0379964 0.3065797 0.1550178 0.1710811 -0.0128971 -0.150344 0.7737834 -0.0059431 -0.0204466 0.0293057 0.3076843 1.0017584 -0.0317615 0.0780559 -0.3716901 0.2555819 -0.0419936 0.0719138 -0.004425 0.3019788 -0.0234745 -0.0741643 -0.0084545 -0.0760076 -0.3574013 -0.0158805 -0.0087084 -0.0157826 0.0400143 0.1191444 -0.0489515 -0.0050453 -0.0302294 -0.0199903 -0.0068847 -0.0046229 -0.0089542 0.1542956 0.0622802 -0.0616499 -0.0128351 -0.0518229 -0.0142126 -0.0095364 -0.0128958 -0.0106407 0.1662243 0.0660162 0.0813913 -0.0085966 0.0248809 0.0463659 0.0003538 -0.0095886 0.0066515 0.1586873 0.0149204 -0.1318478 0.1180143 0.0272012 -0.00568 -0.0059973 0.0921597 0.0288211 -0.051019 0.0557437 -0.117826 -0.1007273 0.0287973 -0.003702 0.0159407 -0.0675564 -0.0520939 -0.0932028 -0.0376725 0.1350426 -0.0139327 0.0851213 -0.0109693 0.0059216 -0.0151645 0.0112642 0.1232132 -0.0114723 -0.014751 0.0419753 0.1370899 0.023303 0.1099822 -0.0154515 0.0973119 -0.0542801 -0.0082979 0.0087619 -0.0297702 0.1570924 0.0309367 -0.0736003 0.0324322 -0.0944319 -0.0644942 -0.1304109 -0.075872 -0.0298139 -0.1273499 0.0011845 -0.0169307 -0.0312471 -0.011129 0.1169909 unknown
polarizability: 211.3438738|9.2497747|142.4101053|16.9152039|2.7587627|60.2736188 unknown
InChI: InChI=1S/C10H9NO3/c1-13-9-4-3-7(8(12)6-11)5-10(9)14-2/h3-5H,1-2H3
charge 0 multiplicity 1
23 atoms
O  -2.146176 1.325682 -0.112306
O  -3.046576 -1.45871 -0.273451
O  3.378299 -1.357079 0.432918
N  3.420494 2.094046 0.503788
C  -1.215241 0.275933 -0.034717
C  -1.727594 -1.065647 -0.119887
C  1.068014 -0.626886 0.195163
C  0.169387 0.47378 0.120151
C  -0.816872 -2.155782 -0.042834
C  0.557444 -1.951182 0.112177
C  2.519253 -0.426121 0.357234
C  -1.630661 2.697235 -0.023616
C  -4.181431 -0.517085 -0.383633
C  2.986548 0.982405 0.435205
H  0.57061 1.490106 0.184721
H  -1.241996 -3.161234 -0.110594
H  1.254353 -2.792523 0.171195
H  -0.934012 2.917652 -0.854755
H  -1.125778 2.872861 0.945376
H  -2.519003 3.340294 -0.102462
H  -4.068135 0.134818 -1.26394
H  -4.271835 0.099105 0.524565
H  -5.055492 -1.17597 -0.496299
