program: Gaussian 09
title: 000269458
version: EM64L-G09RevD.01
frameworkgroup: C1[X(C14H20N2O2)]
method: RPBEPBE
basis: SDD
operation: Freq
keyword: #p
keyword: freq=noraman
keyword: PBEPBE/SDD
title: #p freq=noraman PBEPBE/SDD
converged: YES YES NO NO
title: Mulliken charges:
elementType: O O N N C C C C C C C C C C C C C C H H H H H H H H H H H H H H H H H H H H
charge: -0.291664 -0.211919 -0.390144 0.048862 -0.335344 -0.341967 -0.565320 -0.692529 0.251379 0.261660 0.240984 -0.348989 -0.354784 -0.380114 -0.246971 -0.241105 -0.232177 -0.686366 0.216401 0.216047 0.188120 0.188164 0.230589 0.230592 0.213150 0.213224 0.213930 0.281087 0.285577 0.244084 0.243370 0.211321 0.211358 0.230909 0.226036 0.211459 0.230532 0.230558
chargesum: 0.00000
title: Mulliken charges with hydrogens summed into heavy atoms:
elementType: O O N N C C C C C C C C C C C C C C
charge: -0.291664 -0.211919 -0.109057 0.048862 0.097103 0.034317 -0.104139 -0.052225 0.251379 0.261660 0.240984 -0.063412 -0.110700 -0.136744 -0.016062 0.181574 -0.006141 -0.013817
polarizability: 3.15185258e+02 7.21322773e+00 1.93370905e+02 2.87121676e-02 -2.15412398e-02 9.73015422e+01
1716.lowfreq: -50.2811 -8.5861 -5.2454 -0.0008 0.0004 0.0008 2.5387 22.0270 32.6130
frequency: -49.9656 21.7176 32.6101 39.4158 68.3111 73.4052 87.9454 105.1308 108.5422 134.8175 142.0649 189.7256 203.1061 215.8400 232.1163 236.1128 246.9265 296.4107 316.6027 329.9404 368.1454 381.7350 475.9235 478.6979 510.9651 538.6101 553.0119 593.0408 634.1908 637.4959 699.7583 723.7458 741.8806 759.6316 764.7551 795.5762 826.4682 841.7809 863.8618 899.1233 906.9207 921.4560 947.9771 955.8966 957.4022 993.2332 1015.7359 1036.4166 1044.4186 1051.8963 1085.7849 1095.2442 1097.9012 1115.4399 1121.7501 1136.9897 1162.0626 1174.2643 1202.1630 1204.9967 1233.6113 1256.5015 1264.1344 1277.6152 1286.6702 1296.5377 1321.0941 1328.4891 1356.6341 1369.3213 1389.6295 1391.3596 1399.9018 1439.5042 1441.6836 1461.0903 1463.9263 1471.7588 1474.4464 1477.5691 1480.5342 1487.4328 1492.3044 1502.2381 1564.6794 1592.2498 1607.1239 1648.0712 2954.7628 2959.1354 2960.0113 2975.0294 2997.5389 2999.9563 3000.8230 3005.1694 3017.6838 3018.9581 3060.3824 3073.5147 3073.8855 3094.8135 3106.0975 3133.1448 3149.7495 3164.2442 3173.6487 3357.5452
redmass: 1.6093 4.7925 4.3448 4.8302 3.2505 3.5937 4.1589 1.9711 1.8073 4.4419 3.8665 4.3906 3.4146 4.7052 1.4662 1.1204 2.5291 4.2433 3.9508 4.1199 4.0950 5.6623 3.7958 3.0924 5.4243 3.0924 3.1521 6.3815 1.1895 5.7872 5.5365 1.1010 3.4023 1.3153 4.4509 1.2777 1.1090 4.7417 1.3803 1.8013 3.3136 1.3032 1.3868 5.6744 1.4634 1.3434 5.5840 2.7983 2.1031 2.9868 2.0234 1.4507 2.4671 2.2994 2.6553 1.4417 2.3944 1.0987 2.1554 1.4800 2.2949 1.4417 1.1372 1.1838 1.0549 1.5391 1.5993 1.6146 1.6724 1.3480 3.9616 1.2207 1.3536 2.1692 1.1529 1.0402 1.0733 1.6422 1.0719 1.0420 1.1992 1.0749 1.1780 1.8874 6.4717 6.2128 6.4054 7.2396 1.0589 1.0588 1.0555 1.0359 1.0361 1.0604 1.0984 1.1011 1.0876 1.1077 1.1031 1.0995 1.1011 1.0988 1.1015 1.0858 1.0901 1.0942 1.0994 1.0750
irintensity: 0.0000 2.1111 0.6485 3.5981 0.0098 9.1889 1.3623 2.8141 0.7059 5.8631 0.0184 2.0537 11.4117 0.1367 8.8793 0.4296 3.3241 13.1852 2.8305 0.2403 2.7941 0.7251 0.2084 5.9187 2.4018 2.6143 1.3756 6.6695 74.0602 6.6675 9.5105 12.4599 0.0004 94.6532 9.3818 0.1705 0.9465 1.2455 0.0230 16.0823 35.9756 5.0168 5.3471 37.9392 25.8208 2.2227 10.7978 68.5917 12.5479 16.9027 6.2508 0.0134 99.3358 27.0540 1.5586 4.6842 451.7827 8.1333 59.2781 0.1053 205.2096 60.1563 0.0123 0.2503 0.0412 9.9908 26.9446 30.8117 1.0089 4.3803 35.9952 16.3980 37.4884 76.3498 0.4542 12.5182 3.1744 54.1994 8.2738 12.4606 22.5605 18.1779 9.6695 266.5094 1.3635 29.7517 39.0870 236.1159 8.8131 50.9721 51.1368 38.7416 21.9004 25.9270 24.5993 0.0006 39.4287 32.6231 10.9990 53.3928 98.6579 31.1761 35.8685 1.4996 12.4464 17.1070 24.0090 14.6840
temp: 298.150 k
press: 1.00000 atm
elementType: 8 8 7 7 6 6 6 6 6 6 6 6 6 6 6 6 6 6 1 1 1 1 1 1 1 1 1 1 1 1 1 1 1 1 1 1 1 1
symmnumber: 1
zpe: 828110.7 jmol-1
zpe.correction: 0.315411 hartree
zpe.thermalcorrener: 0.334221 hartree
zpe.thermalcorrenthalpy: 0.335165 hartree
zpe.thermalcorrgfe: 0.266076 hartree
zpe.sumelectzpe: -804.042553 hartree
zpe.sumelectthermal: -804.023743 hartree
zpe.sumelectthermalent: -804.022799 hartree
zpe.sumelectthermalfe: -804.091887 hartree
dipole: -3.2020 5.6332 0.0006
dipole: 6.4796
quadrupole: -85.4628 -104.3058 -111.0416
quadrupole: 5.1385 -0.0242 0.0160
quadrupole: 14.8073 -4.0357 -10.7715 5.1385 -0.0242 0.0160
hfenergy: -804.3579633 hartree
pointgroup: C01 [X(C14H20N2O2)]
dipole: 1.1437786 2.2778902 0.0429352 debye
polarizability: 315.4899546|-0.9536323|192.9466396|4.9827673|0.7221842|97.4211116 unknown
InChI: InChI=1S/C14H20N2O2/c1-3-5-10-14(17)16-15-11-12-8-6-7-9-13(12)18-4-2/h6-9,11,16H,3-5,10H2,1-2H3
charge 0 multiplicity 1
38 atoms
O  3.004221 1.670879 0.153813
O  -3.000603 -1.731372 -0.012712
N  -1.627561 0.17356 0.035181
N  -0.439925 -0.535529 0.057328
C  -5.419158 -0.206289 -0.057374
C  -6.603195 0.78551 -0.068796
C  -4.054398 0.507443 -0.01836
C  -7.972029 0.072235 -0.108221
C  -2.875417 -0.481317 0.00039
C  1.977285 -0.501699 0.113555
C  3.178521 0.275547 0.146796
C  2.086895 -1.918851 0.104946
C  4.444583 -0.357115 0.170196
C  0.674639 0.169681 0.088794
C  3.34436 -2.551291 0.128346
C  4.209686 2.523185 0.185185
C  4.52201 -1.767305 0.160902
C  3.728196 3.971503 0.184163
H  -5.5006 -0.882486 0.814493
H  -5.463376 -0.858414 -0.9500
H  -6.513873 1.459943 -0.94571
H  -6.551546 1.434735 0.829863
H  -3.996906 1.160085 0.878081
H  -3.954507 1.176919 -0.898502
H  -8.062998 -0.55945 -1.011618
H  -8.10142 -0.584483 0.772352
H  -8.806607 0.797132 -0.116003
H  -1.617484 1.206637 0.043825
H  1.15848 -2.49829 0.079328
H  5.365903 0.231261 0.19526
H  0.686392 1.27528 0.097423
H  4.797348 2.294559 1.097657
H  4.83589 2.305891 -0.704092
H  3.409902 -3.643994 0.121279
H  5.505154 -2.250594 0.179246
H  4.594321 4.657503 0.207626
H  3.138003 4.1861 -0.722999
H  3.098917 4.174292 1.067462
