program: Gaussian 09
title: 000269419
version: EM64L-G09RevD.01
frameworkgroup: C1[X(C11H16)]
method: RPBEPBE
basis: SDD
operation: Freq
keyword: #p
keyword: freq=noraman
keyword: PBEPBE/SDD
title: #p freq=noraman PBEPBE/SDD
converged: YES YES NO NO
title: Mulliken charges:
elementType: C C C C C C C C C C C H H H H H H H H H H H H H H H H
charge: 0.258770 0.258763 0.115565 -0.718422 -0.718466 -0.718418 -0.718470 -0.306882 -0.306915 -0.310003 -0.309989 0.209869 0.209095 0.222790 0.222804 0.209106 0.209848 0.209872 0.209095 0.222782 0.209105 0.209843 0.222808 0.222697 0.222700 0.231028 0.231028
chargesum: 0.00000
title: Mulliken charges with hydrogens summed into heavy atoms:
elementType: C C C C C C C C C C C
charge: 0.258770 0.258763 0.115565 -0.076668 -0.076709 -0.076669 -0.076715 -0.084185 -0.084215 -0.078975 -0.078962
polarizability: 1.42699248e+02 7.40512914e-06 1.07718041e+02 1.55559013e-03 -2.91739591e-01 9.36358059e+01
1716.lowfreq: -11.8517 0.0007 0.0007 0.0009 5.3207 20.8579 98.0709 100.6164 130.5395
frequency: 97.8770 100.5748 130.5355 145.9205 174.0321 180.4146 193.7606 210.5940 292.3659 301.4651 323.4945 381.4161 413.3796 423.2272 441.1929 511.0503 562.8790 581.1445 646.8061 650.9027 710.1633 779.7672 811.6742 859.5706 895.9097 906.8718 917.6921 937.1084 957.4288 963.0776 983.1651 1001.7662 1015.7861 1067.3102 1086.1127 1105.0052 1114.1247 1148.6879 1159.5529 1170.5734 1226.0706 1254.9459 1313.2144 1365.5267 1379.3602 1391.1845 1393.1636 1400.5337 1415.2774 1452.3726 1457.6879 1466.4825 1467.8492 1477.9079 1479.5659 1480.4245 1499.9381 1501.4061 1556.7140 2975.2080 2977.1442 2977.8628 2982.6113 3055.9465 3057.7528 3060.3610 3063.1263 3098.6853 3102.9704 3110.3094 3112.8799 3159.8000 3171.2641 3189.5964 3204.4081
redmass: 1.1964 2.7527 1.4500 1.9953 1.3153 2.4742 1.1322 1.6981 2.5663 1.8148 2.8706 2.4216 3.5039 2.3709 3.0427 3.4122 2.5523 2.8478 3.2168 1.8673 1.3482 2.0677 5.6493 3.8617 1.9880 1.4358 1.3872 1.3626 1.3597 1.8326 1.2533 1.2897 2.0235 1.3330 1.3035 1.7804 1.7087 2.2059 2.8179 2.2267 2.0950 4.1865 2.4261 2.4692 1.2915 1.2162 1.2126 2.1936 1.3783 1.0523 1.0448 1.0532 1.0508 1.0454 3.6682 1.0480 1.1221 1.2900 5.3936 1.0388 1.0394 1.0390 1.0393 1.0982 1.0984 1.0976 1.0975 1.0978 1.0970 1.0944 1.0943 1.0862 1.0895 1.1008 1.1094
irintensity: 0.0001 0.6392 0.0319 0.0022 0.5982 0.0053 0.2984 0.0001 0.1219 2.1228 1.8449 0.0027 1.3878 0.1118 0.0002 7.5191 0.5442 0.0005 12.5970 55.0925 0.0001 80.9530 1.3948 7.6223 1.7984 5.5773 0.0000 0.0167 4.3857 65.2503 0.3295 0.0000 0.0152 35.6375 20.7711 0.5640 60.7223 71.1867 0.1922 24.1268 0.7104 0.0071 0.7472 7.7947 0.0020 19.9012 31.6681 3.1555 0.6106 0.0006 0.0001 9.8534 19.6357 9.4484 16.1987 8.0714 35.3347 8.4538 0.0342 0.0703 44.2480 65.4394 66.4204 0.0192 0.4859 20.3703 86.2280 0.1775 55.8964 50.2549 8.8474 1.5573 10.5873 30.2792 12.5721
temp: 298.150 k
press: 1.00000 atm
elementType: 6 6 6 6 6 6 6 6 6 6 6 1 1 1 1 1 1 1 1 1 1 1 1 1 1 1 1
symmnumber: 1
zpe: 613887.2 jmol-1
zpe.correction: 0.233817 hartree
zpe.thermalcorrener: 0.246054 hartree
zpe.thermalcorrenthalpy: 0.246998 hartree
zpe.thermalcorrgfe: 0.197007 hartree
zpe.sumelectzpe: -427.863330 hartree
zpe.sumelectthermal: -427.851093 hartree
zpe.sumelectthermalent: -427.850149 hartree
zpe.sumelectthermalfe: -427.900140 hartree
dipole: 1.8546 0.0000 0.0000
dipole: 1.8546
quadrupole: -67.0891 -64.7366 -69.6142
quadrupole: -0.0001 0.0000 -0.1006
quadrupole: 0.0575 2.4100 -2.4675 -0.0001 0.0000 -0.1006
hfenergy: -428.0971469 hartree
pointgroup: C01 [X(C11H16)]
dipole: 0.7296567 0.0001612 0.0004594 debye
polarizability: 142.6992242|0.007402|107.7227473|0.0331182|0.1372507|93.6311234 unknown
InChI: InChI=1S/C11H16/c1-9(2)10(3,4)11(9)7-5-6-8-11/h5-8H,1-4H3
charge 0 multiplicity 1
27 atoms
C  1.069721 0.007038 -0.763946
C  1.068727 -0.006651 0.765209
C  -0.33101 -0.000136 -0.000291
C  1.450836 1.273386 -1.535491
C  1.451656 -1.245197 -1.557854
C  1.449428 -1.272828 1.53724
C  1.448998 1.245756 1.559641
C  -1.241342 1.181967 0.010271
C  -1.240821 -1.182628 -0.01191
C  -2.547369 0.735635 0.005196
C  -2.547044 -0.736851 -0.008673
H  1.186085 2.20655 -1.01517
H  2.543103 1.288053 -1.718182
H  0.942695 1.28516 -2.51734
H  0.942402 -1.240656 -2.539216
H  2.543735 -1.254993 -1.742012
H  1.189109 -2.187773 -1.053545
H  1.18555 -2.206106 1.016687
H  2.5415 -1.287119 1.721131
H  0.940215 -1.284716 2.518533
H  2.540808 1.256011 1.74537
H  1.186781 2.188208 1.054931
H  0.938329 1.24102 2.540266
H  -0.918487 2.224767 0.020615
H  -0.917518 -2.225293 -0.021783
H  -3.442644 1.362286 0.010656
H  -3.442042 -1.363887 -0.015332
