program: Gaussian 09
title: 000269417
version: EM64L-G09RevD.01
frameworkgroup: C1[X(C11H13Br)]
method: RPBEPBE
basis: SDD
operation: Freq
keyword: #p
keyword: freq=noraman
keyword: PBEPBE/SDD
title: #p freq=noraman PBEPBE/SDD
converged: YES YES NO NO
title: Mulliken charges:
elementType: Br C C C C C C C C C C C H H H H H H H H H H H H H
charge: -0.037951 0.346520 -0.336034 -0.582885 -0.721247 -0.735253 0.496195 -0.397420 -0.353684 -0.227980 -0.234929 -0.235322 0.264788 0.244674 0.220335 0.237434 0.213052 0.218960 0.230321 0.215365 0.244630 0.243312 0.228157 0.228700 0.230263
chargesum: 0.00000
title: Mulliken charges with hydrogens summed into heavy atoms:
elementType: Br C C C C C C C C C C C
charge: -0.037951 0.346520 -0.336034 -0.073423 -0.050427 -0.070607 0.496195 -0.152790 -0.110372 0.000177 -0.006229 -0.005058
polarizability: 1.64355626e+02 1.02503121e+00 1.12823339e+02 9.68184362e-01 -1.46322715e+00 1.16655688e+02
1716.lowfreq: -15.6133 -13.7161 -4.9386 0.0003 0.0003 0.0004 45.2907 76.4900 99.3242
frequency: 45.1891 76.4580 99.3166 135.0160 154.8658 182.3351 212.2488 237.8581 266.2674 292.4423 359.4318 385.3427 403.3554 409.6111 497.3935 517.9071 596.8977 613.5956 702.4159 711.7960 730.2053 782.1018 855.0628 855.4192 897.0864 930.6407 954.9674 962.4797 980.6117 990.8095 995.9485 998.1707 1021.2727 1041.4461 1054.9366 1073.7766 1087.9955 1126.5786 1172.7544 1185.6333 1240.6275 1267.1149 1314.8038 1366.2441 1376.3641 1384.5620 1397.7403 1434.5475 1448.4658 1461.0908 1462.9456 1477.0760 1479.9760 1488.4710 1586.6631 1609.1885 2974.7488 2979.0201 3059.7317 3064.6714 3086.2468 3090.8270 3099.7197 3124.1142 3129.7376 3141.1379 3150.6444 3165.3436 3192.8724
redmass: 3.9452 5.3064 3.0462 1.7421 3.5395 1.4901 1.2819 5.6071 3.1727 3.0303 2.2651 3.4890 2.7222 2.3523 3.4593 2.9877 3.8446 6.3476 1.7939 4.1963 2.9252 1.9966 1.8628 1.8571 1.3729 1.4540 1.3137 2.3227 1.3912 5.6502 1.4098 1.3583 2.1522 1.6002 1.4012 2.0026 1.6434 1.8385 1.0538 1.1137 3.6580 3.3209 1.3582 2.8236 7.6849 1.2423 1.1998 2.2335 1.2305 1.0471 1.0500 1.1441 1.1675 1.8940 6.0974 6.0692 1.0365 1.0369 1.0994 1.0986 1.0590 1.0974 1.0980 1.0845 1.0876 1.0922 1.0967 1.1016 1.1138
irintensity: 0.0028 0.7429 0.1434 0.2414 0.2969 0.3110 0.1248 2.6179 5.7965 0.6960 0.3996 1.3381 0.9430 0.6497 7.6178 1.6136 44.5724 0.4865 45.8668 0.9946 58.4480 13.4285 1.7038 1.3002 1.0590 0.8023 3.0088 13.6286 0.0249 0.0913 7.5257 2.1590 8.8342 17.1351 6.9630 15.0196 7.7326 25.2335 0.0011 0.8921 17.9098 4.5977 0.9737 5.8014 0.0852 13.0821 6.7482 11.1263 20.3436 1.7037 7.9183 11.1582 20.0712 2.8245 0.7740 0.3471 21.2755 52.1770 1.1741 58.5273 6.1082 27.9315 20.0808 2.0901 0.1308 17.2477 36.7975 20.7183 7.6080
temp: 298.150 k
press: 1.00000 atm
elementType: 35 6 6 6 6 6 6 6 6 6 6 6 1 1 1 1 1 1 1 1 1 1 1 1 1
symmnumber: 1
zpe: 536240.1 jmol-1
zpe.correction: 0.204243 hartree
zpe.thermalcorrener: 0.216500 hartree
zpe.thermalcorrenthalpy: 0.217445 hartree
zpe.thermalcorrgfe: 0.165022 hartree
zpe.sumelectzpe: -439.515313 hartree
zpe.sumelectthermal: -439.503056 hartree
zpe.sumelectthermalent: -439.502112 hartree
zpe.sumelectthermalfe: -439.554534 hartree
dipole: 1.0379 2.3930 0.3457
dipole: 2.6312
quadrupole: -74.7582 -84.8561 -75.8115
quadrupole: -3.3645 -0.4560 -0.9387
quadrupole: 3.7171 -6.3808 2.6638 -3.3645 -0.4560 -0.9387
hfenergy: -439.7195562 hartree
pointgroup: C01 [X(C11H13Br1)]
dipole: -0.1697537 -1.0206066 0.0342469 debye
dipolederiv: -0.3672349 -0.1518465 0.002191 -0.3148003 -0.7811538 0.0507584 0.0194171 0.0816892 -0.1354995 0.1152598 -0.064159 0.0495493 -0.061991 0.0034156 -0.0853762 0.1144559 -0.0028069 0.0747918 0.4549128 0.3046905 -0.006435 0.3675839 0.960405 -0.0473424 -0.0329978 -0.0878623 0.1813408 -0.0690944 0.045442 -0.0464289 0.0508984 -0.12415 0.0561819 -0.0796321 -0.0301118 -0.2452554 -0.0127941 -0.1151312 0.0111157 0.0311421 -0.0069801 -0.0239393 -0.0178326 -0.0400022 0.0774192 -0.0324761 0.0362369 0.0475699 -0.0606209 -0.0211494 -0.010765 0.0143275 0.0493705 0.0626143 0.0094734 -0.0084493 0.0045069 0.148185 -0.1522574 0.0252858 0.0145835 0.02973 -0.0400766 -0.0884098 0.025172 0.0767498 -0.0312376 -0.1357124 0.0306723 -0.0094504 -0.0023674 0.0499471 -0.059976 0.0157256 -0.1077127 0.0067298 -0.1126603 -0.023526 -0.035839 0.0161717 0.0151509 -0.0201303 0.0098606 -0.1186324 0.0192233 -0.1286173 -0.014433 -0.1344589 -0.0351162 0.0487115 -0.072687 0.003308 0.0913879 0.0210928 -0.1354473 0.0183293 0.1045009 0.0377979 0.0924618 0.0798862 0.0271023 0.015883 0.0296622 -0.1541459 0.0051307 0.012674 0.0055962 -0.0295883 0.006087 -0.0822203 -0.0645813 -0.078853 0.0611174 -0.0562924 -0.0471762 -0.0003576 0.0367465 0.0436341 -0.0506075 0.0706324 -0.065273 -0.0187896 0.0860459 0.0401419 0.041976 0.0046669 0.0557866 0.0194796 -0.0364472 -0.0208393 0.0993297 0.0248983 0.0346301 0.0108949 -0.1605804 0.083475 -0.0561245 -0.0013614 -0.1121729 -0.050203 -0.0528363 -0.0264933 -0.0755696 0.0479804 -0.088273 0.1150022 0.0115021 0.1667236 -0.044015 0.0239564 -0.0104407 0.0395543 0.0743905 -0.0624759 0.1438885 -0.0275929 0.1279995 -0.0882027 -0.0081433 -0.0457065 0.0164389 0.0795474 -0.0699931 -0.093701 0.064066 -0.0927453 0.074666 0.0032269 0.0979854 0.0269173 0.0238424 0.1005083 -0.023002 -0.0500376 -0.0054391 0.0597941 0.0218188 -0.03342 -0.0479695 -0.1502897 0.0739815 -0.0128217 -0.0912615 -0.0213073 0.1227325 -0.0120613 -0.071288 -0.0166523 -0.0491881 0.0271359 -0.008626 0.1035828 -0.0212295 0.120316 0.0018029 0.0962492 0.0000613 -0.0087183 -0.0128525 -0.0203929 0.0944467 -0.0147881 0.1532225 0.0095645 0.1147971 0.010463 -0.0490635 0.036104 -0.0171901 -0.0688745 -0.0205145 0.1498325 -0.0179735 -0.0932265 -0.0214062 -0.0889546 -0.1298474 -0.0416362 -0.0238181 -0.0474287 0.1486531 -0.0049832 -0.0258007 -0.0064392 0.0876028 unknown
polarizability: 160.8635988|12.9899039|116.0104466|-1.6019844|0.621537|116.9606082 unknown
InChI: InChI=1S/C11H13Br/c1-10(2)8-11(10,12)9-6-4-3-5-7-9/h3-7H,8H2,1-2H3
charge 0 multiplicity 1
25 atoms
Br 1.393789 2.416327 0.018791
C  2.06301 -0.594639 -0.065448
C  0.979013 0.434389 0.332229
C  1.802738 -0.242765 1.423806
C  3.382952 -0.149655 -0.690452
C  1.582812 -1.957214 -0.573645
C  -0.491008 0.198861 0.160559
C  -1.344478 0.118603 1.290109
C  -1.053524 0.080738 -1.137976
C  -2.732394 -0.087595 1.127828
C  -2.439236 -0.124195 -1.3018
C  -3.283658 -0.210371 -0.168602
H  2.563463 0.354301 1.934642
H  1.295843 -0.976926 2.061169
H  3.27486 -0.0177 -1.783704
H  3.743535 0.803489 -0.27091
H  4.156763 -0.92045 -0.514658
H  2.350754 -2.724234 -0.359194
H  0.638603 -2.272508 -0.098391
H  1.419945 -1.937603 -1.667742
H  -0.916329 0.226516 2.293336
H  -0.399833 0.16192 -2.01392
H  -3.38266 -0.146615 2.007794
H  -2.862918 -0.214128 -2.30829
H  -4.360642 -0.367348 -0.296129
