program: Gaussian 09
title: 000269420
version: EM64L-G09RevD.01
frameworkgroup: C1[X(C11H8Cl2O3S)]
method: RPBEPBE
basis: SDD
operation: Freq
keyword: #p
keyword: freq=noraman
keyword: PBEPBE/SDD
title: #p freq=noraman PBEPBE/SDD
converged: YES YES NO NO
title: Mulliken charges:
elementType: Cl Cl S O O O C C C C C C C C C C C H H H H H H H H
charge: -0.009708 -0.003602 0.982904 -0.333851 -0.508902 -0.506201 0.264918 0.586651 0.231667 -0.383536 -0.363194 -0.291749 -0.386215 -0.262127 -0.233544 -0.223321 -0.744379 0.288427 0.265290 0.285155 0.242605 0.238571 0.288383 0.286291 0.289467
chargesum: 0.00000
title: Mulliken charges with hydrogens summed into heavy atoms:
elementType: Cl Cl S O O O C C C C C C C C C C C
charge: -0.009708 -0.003602 0.982904 -0.333851 -0.508902 -0.506201 0.264918 0.586651 0.231667 -0.383536 -0.074767 -0.291749 -0.120925 0.023028 0.009061 0.015250 0.119761
polarizability: 3.43866216e+02 2.03222127e+00 2.23005776e+02 6.18308135e-01 -2.86045558e+00 9.65008229e+01
1716.lowfreq: -9.5644 -0.0019 -0.0017 0.0014 2.0306 6.5040 25.5024 30.9037 43.3702
frequency: 25.4457 30.7837 43.3502 67.7932 107.3523 118.4271 121.8581 129.8923 153.7700 187.1605 202.0065 212.0800 237.3664 263.3784 300.5750 314.7097 337.7472 355.8380 374.4654 410.6290 429.8860 481.8055 500.1140 557.0598 565.8061 598.8233 611.5717 681.2711 694.1083 719.1211 785.4327 802.4443 813.2588 835.3606 864.0771 893.7105 900.3048 923.1243 971.9662 980.1223 1005.4710 1021.9749 1031.8285 1067.3972 1145.9148 1176.5928 1198.6570 1220.4558 1272.3177 1306.4288 1311.7097 1362.0073 1401.2988 1410.7895 1412.9587 1418.4916 1430.3892 1493.4426 1527.5374 1563.2804 1614.4340 3034.7291 3141.3063 3155.0708 3167.9641 3177.2302 3183.9904 3185.0924 3194.0206
redmass: 9.7822 6.6919 7.9599 13.4855 7.3638 4.2766 4.6469 6.3767 1.1144 18.3209 5.7756 7.7079 4.3481 7.3194 9.6284 11.1670 11.8134 11.7981 11.7862 5.0215 4.5124 7.4755 3.9050 6.3788 8.1433 3.8500 7.1081 5.3250 7.5180 6.5045 1.4107 3.6824 10.6985 6.6748 1.4106 3.5291 1.6829 6.3965 1.2586 1.3712 1.3534 1.6798 2.3809 3.6745 1.6410 1.1396 1.9284 3.0268 1.7826 1.2862 3.2201 3.8518 4.1708 1.0558 3.8659 1.0635 2.6410 3.6307 7.1896 7.4166 6.1990 1.0242 1.0862 1.0897 1.0951 1.1003 1.0934 1.1080 1.1077
irintensity: 0.1066 5.1445 3.8127 3.6130 17.3415 0.6142 1.0516 3.7895 0.6313 3.6554 12.5704 0.7755 7.1450 35.8807 10.6793 39.6679 17.1558 22.9072 7.1825 4.4357 3.9082 0.9692 0.4716 10.3138 43.7481 1.0865 6.2888 11.6500 31.2239 10.8465 72.4083 11.8685 72.4224 28.0934 18.3865 29.9764 2.3531 55.7533 76.7354 1.9100 0.4522 30.9036 1.4845 16.3169 19.6063 15.0382 38.8776 90.3305 2.1009 7.7847 2.2101 14.1574 39.0661 15.0407 14.6634 9.9862 8.9211 156.0891 35.6749 115.3871 10.6797 0.0270 4.0464 5.2333 3.6469 20.3191 2.5797 0.0749 0.1041
temp: 298.150 k
press: 1.00000 atm
elementType: 17 17 16 8 8 8 6 6 6 6 6 6 6 6 6 6 6 1 1 1 1 1 1 1 1
symmnumber: 1
zpe: 426090.6 jmol-1
zpe.correction: 0.162289 hartree
zpe.thermalcorrener: 0.179466 hartree
zpe.thermalcorrenthalpy: 0.180410 hartree
zpe.thermalcorrgfe: 0.115075 hartree
zpe.sumelectzpe: -1966.447816 hartree
zpe.sumelectthermal: -1966.430639 hartree
zpe.sumelectthermalent: -1966.429695 hartree
zpe.sumelectthermalfe: -1966.495031 hartree
dipole: -0.6376 -0.6902 -1.9891
dipole: 2.1999
quadrupole: -101.8466 -113.1988 -128.4189
quadrupole: -13.8541 -6.1905 -2.1736
quadrupole: 12.6415 1.2893 -13.9308 -13.8541 -6.1905 -2.1736
hfenergy: -1966.6101052 hartree
pointgroup: C01 [X(C11H8Cl2O3S1)]
dipole: -0.2493155 -0.2368138 -0.794264 debye
dipolederiv: -0.8117722 -0.4161771 0.1336985 -0.3680647 -0.3415818 0.0725842 0.2508844 0.1400964 -0.0788152 -0.3173582 0.4779129 0.2054878 0.16898 -0.4208721 -0.1327363 0.0724899 -0.1388469 -0.0855903 1.6261901 0.1911618 0.0582228 -0.0427554 0.9720901 0.0122292 0.4322052 0.2021989 1.1094312 0.4555373 0.3268493 0.2019811 0.496895 -0.1581293 0.1126199 0.251928 0.0536315 -0.3606309 -0.8933619 -0.2193072 -0.0347935 -0.5357657 -0.7443616 -0.0990033 -0.2014553 -0.0932849 -0.4608464 -0.6342253 -0.0231345 -0.0363872 0.2927713 -0.3176715 0.1242532 -0.5446333 -0.1436897 -0.6260812 0.1064753 0.1225788 0.0412374 -0.391495 0.0093896 -0.0518463 -0.0354281 -0.0463887 0.0097907 -0.1801666 -0.2438478 0.0747622 -0.2375826 -0.4087043 0.0032959 0.0922282 0.0935325 0.0551794 -0.3826777 -0.0553363 -0.1310537 -0.5311389 -0.1464023 -0.1796523 0.3104668 0.0854659 0.0965319 1.3115331 0.5503992 -0.2841472 0.08923 0.7630445 -0.1006033 -0.4543242 -0.2038461 0.0140375 -0.2385052 0.0990389 -0.0552466 0.3675712 -0.1000665 0.0224568 0.0452472 -0.0165779 -0.0936665 0.8138257 -0.6061868 -0.3321903 0.3856518 0.6991078 0.2620464 -0.3637686 0.114014 0.0414804 0.0170047 -0.0579882 -0.0547391 0.2264551 0.0728563 -0.0138866 -0.0602019 0.0126345 -0.1225209 -1.0261524 0.0296005 0.1118897 0.2263076 -0.1507344 -0.0181794 0.3081749 -0.0041606 -0.0667092 0.2252127 0.0723125 -0.0062003 0.0571863 0.1902206 -0.0300555 -0.1122488 -0.0159927 -0.1280458 0.0428031 -0.1379075 -0.0802133 -0.2594082 -0.1164909 0.0216681 -0.0576523 0.047624 -0.1119607 -0.2926683 -0.0476811 0.0263399 -0.0418681 -0.1184813 -0.0221953 -0.2164882 -0.0933853 -0.0855456 0.0194474 -0.0772525 0.0394338 -0.0104865 0.085873 -0.0018834 -0.001604 -0.008015 0.1287258 0.0216049 -0.0176137 0.0442042 -0.0887105 0.072195 0.0242894 0.0531758 0.0069663 0.1438313 0.0957999 -0.0028225 0.0142997 -0.0130913 0.0296863 0.0053335 0.0374006 0.007549 0.1593016 0.091518 -0.0134797 0.0170738 0.0169296 -0.0942432 0.0138029 0.016463 0.0057503 0.149361 -0.0435461 0.0938225 0.0512434 0.1000979 0.0233447 -0.0220229 0.0579917 -0.0284805 0.1420811 0.0489228 0.0217236 0.0153614 0.0405822 0.0726732 0.0408429 0.0083922 0.0380861 0.0179882 -0.0978536 -0.0341221 -0.0409753 0.0591725 0.1232899 -0.0296524 0.0704024 -0.0009661 0.0576466 0.0424125 -0.0325431 0.0207109 -0.0074636 0.0039683 -0.0137052 0.0403543 -0.0139148 0.0950261 unknown
polarizability: 337.4380778|26.1529739|227.9226146|-13.7291678|8.6273237|98.0121227 unknown
InChI: InChI=1S/C10H5Cl2O.CH3O2S/c11-8-5-9(12)10(13)7-4-2-1-3-6(7)8;1-4(2)3/h1-5H;1H3
charge 0 multiplicity 1
25 atoms
Cl -3.496276 -2.28917 0.617842
Cl 1.760447 -2.628071 -0.962298
S  2.966804 0.989713 0.360879
O  1.565571 0.408416 -1.174902
O  3.131437 2.608087 0.473414
O  2.671364 0.091759 1.689794
C  -0.724808 0.633114 -0.3721
C  -1.961249 0.005439 0.043781
C  0.44264 -0.174364 -0.713437
C  -1.979267 -1.428379 0.109176
C  -0.651487 2.055305 -0.434169
C  0.333814 -1.58645 -0.583023
C  -3.085746 0.82783 0.369579
C  -0.868036 -2.221045 -0.193051
C  -1.764478 2.8378 -0.102166
C  -2.98689 2.220763 0.299033
C  4.481813 0.288521 -0.559515
H  0.288661 2.517548 -0.748641
H  -4.020824 0.350755 0.677525
H  -0.920607 -3.309858 -0.124082
H  -1.697033 3.929513 -0.150065
H  -3.85105 2.842888 0.553886
H  4.50831 0.810478 -1.524942
H  5.356981 0.507792 0.068342
H  4.28051 -0.784679 -0.670361
