program: Gaussian 09
title: 000269427
version: EM64L-G09RevD.01
frameworkgroup: C1[X(C8H8Cl2O6S2)]
method: RPBEPBE
basis: SDD
operation: Freq
keyword: #p
keyword: freq=noraman
keyword: PBEPBE/SDD
title: #p freq=noraman PBEPBE/SDD
converged: YES YES NO NO
title: Mulliken charges:
elementType: Cl Cl S S O O O O O O C C C C C C C C H H H H H H H H
charge: 0.017278 0.017331 1.000361 1.000404 -0.361111 -0.361133 -0.476414 -0.492612 -0.476371 -0.492646 0.434186 0.434190 -0.279056 -0.279100 -0.277453 -0.277202 -0.738853 -0.738884 0.294543 0.294554 0.287504 0.293083 0.298401 0.298424 0.287528 0.293046
chargesum: 0.00000
title: Mulliken charges with hydrogens summed into heavy atoms:
elementType: Cl Cl S S O O O O O O C C C C C C C C
charge: 0.017278 0.017331 1.000361 1.000404 -0.361111 -0.361133 -0.476414 -0.492612 -0.476371 -0.492646 0.434186 0.434190 -0.279056 -0.279100 0.017091 0.017352 0.140135 0.140115
polarizability: 5.08745081e+02 -1.62442444e+01 1.98354128e+02 -9.86730171e-03 1.08785971e-02 1.38665773e+02
1716.lowfreq: -8.2951 -3.9215 -3.7576 0.0014 0.0021 0.0029 11.6066 13.5495 22.4535
frequency: 9.7815 11.4843 22.4513 24.2281 28.7555 58.8086 63.5951 109.3163 120.7772 121.8793 130.2940 135.1095 145.2602 145.6069 165.8564 215.6563 231.8857 240.1574 253.6031 259.5604 288.8003 304.5876 313.6218 318.5631 344.4508 359.9764 363.9464 447.1422 454.7985 481.5764 541.7136 563.9794 569.0052 574.3533 671.8025 688.5463 720.2561 805.1042 822.5278 823.9457 869.5495 887.1178 901.7892 901.8525 945.6181 978.2286 981.4808 1024.9223 1025.2893 1039.7339 1184.5697 1200.4815 1253.9881 1296.5176 1311.0342 1311.6817 1383.5165 1410.5675 1410.6570 1418.0260 1418.0718 1436.9580 1461.3260 1554.5166 3040.5146 3040.5365 3180.5274 3182.5189 3190.1111 3190.1681 3200.1277 3200.1690
redmass: 6.1294 8.5486 10.0553 9.2668 11.7825 9.1128 21.6308 9.4278 5.1426 3.8094 2.5217 3.0243 1.3965 1.5335 6.0506 9.2327 5.2882 4.3751 8.5623 10.0218 11.2266 16.7548 9.7663 9.0526 16.1179 10.6805 11.8674 3.5583 9.6051 8.4408 11.1708 5.9507 8.6511 8.9397 8.2534 8.0807 3.0618 5.9706 12.8075 12.7750 1.7067 1.5071 3.3451 3.3869 8.9954 1.2635 1.3046 1.7642 1.7463 2.7381 3.0179 1.9961 2.5529 7.6514 1.1342 1.1321 5.4021 1.0542 1.0548 1.0539 1.0528 3.9294 8.6589 7.6221 1.0244 1.0244 1.0929 1.0938 1.1083 1.1083 1.1076 1.1076
irintensity: 6.3455 0.1548 0.7303 1.3778 4.5235 11.6131 0.9506 0.1294 0.0456 4.4121 4.6033 2.9326 0.9587 5.1557 51.8544 27.9795 0.0819 0.9954 0.0793 39.6164 2.7601 0.4743 0.4337 94.0485 2.7838 47.9368 77.3853 11.5682 17.2742 1.7081 37.5285 0.3662 164.2539 0.0503 0.0331 0.4828 2.8429 51.4014 52.4113 86.4859 5.0601 47.1835 5.1064 41.8706 7.9693 129.6101 33.4299 39.0872 5.0059 127.9430 2.9641 14.4201 12.3347 5.9047 8.8073 4.2349 11.0104 2.1331 29.5665 3.2981 14.8122 119.6869 6.7774 2.1151 2.6405 0.5923 2.8317 0.1469 0.1653 0.1625 0.0867 0.0894
temp: 298.150 k
press: 1.00000 atm
elementType: 17 17 16 16 8 8 8 8 8 8 6 6 6 6 6 6 6 6 1 1 1 1 1 1 1 1
symmnumber: 1
zpe: 399462.6 jmol-1
zpe.correction: 0.152147 hartree
zpe.thermalcorrener: 0.174339 hartree
zpe.thermalcorrenthalpy: 0.175283 hartree
zpe.thermalcorrgfe: 0.094486 hartree
zpe.sumelectzpe: -2475.524794 hartree
zpe.sumelectthermal: -2475.502602 hartree
zpe.sumelectthermalent: -2475.501658 hartree
zpe.sumelectthermalfe: -2475.582455 hartree
dipole: 0.0023 -0.0078 -5.2007
dipole: 5.2007
quadrupole: -78.2014 -143.0825 -146.8668
quadrupole: -4.7474 -0.0077 0.0039
quadrupole: 44.5155 -20.3656 -24.1499 -4.7474 -0.0077 0.0039
hfenergy: -2475.6769411 hartree
pointgroup: C01 [X(C8H8Cl2O6S2)]
dipole: 0.0011024 0.0053631 2.046101 debye
dipolederiv: -0.0801856 0.2600025 0.0665544 0.1747166 -0.65473 -0.1455906 -0.0026351 -0.0134917 -0.0172825 -0.0802516 0.2599623 -0.0669106 0.1749975 -0.6546903 0.1465286 0.002439 0.0145211 -0.0175319 1.9668909 -0.0036538 0.0964722 0.4449207 1.0089574 0.0619324 0.6405241 -0.0003958 1.206524 1.9662616 -0.0036577 -0.0961207 0.4480944 1.0089601 -0.0619677 -0.6398174 0.0009227 1.2065038 -0.1762651 0.1457556 0.2999879 -0.1682199 -0.3327513 -0.0259916 0.4761027 0.0046492 -0.2694838 -0.1764462 0.1456125 -0.3000685 -0.1701313 -0.3327798 0.0260713 -0.4765851 -0.0045097 -0.2695774 -0.8358192 0.0379662 -0.0789503 0.3432458 -0.4279482 0.1487259 -0.6935675 0.0368673 -0.636856 -0.7586008 -0.0572126 -0.0344985 -0.6406045 -0.5604875 -0.1922327 -0.3023488 -0.0383545 -0.5031 -0.8377805 0.0380538 0.0793945 0.3431663 -0.4280479 -0.1487198 0.6934037 -0.0371098 -0.6364165 -0.7565171 -0.0569421 0.0339493 -0.6406962 -0.560398 0.1923143 0.3028348 0.0383314 -0.5032999 0.0838726 -0.0118068 -0.208474 0.1523622 0.1968676 -0.089715 0.1123235 -0.0001522 0.1043008 0.0840796 -0.0117137 0.2082727 0.1526466 0.1968379 0.0896684 -0.1125789 0.0001461 0.1041564 0.0319459 -0.5953782 0.0732232 -0.3483148 0.9460048 0.3648541 -0.1842627 -0.0018475 -0.0683462 0.0319942 -0.5952644 -0.0723149 -0.3485677 0.9461607 -0.3664039 0.1856449 0.0000798 -0.0677628 0.0259174 0.2604888 0.0412742 0.12556 -0.3573559 -0.1105611 0.0410298 0.0144878 -0.0480973 0.0260914 0.2606522 -0.0416674 0.1253585 -0.3574631 0.111034 -0.0421267 -0.0142378 -0.0482258 -0.269519 -0.0003719 -0.0026485 -0.1147633 -0.0767951 -0.0106871 -0.2515288 -0.0050224 -0.1042164 -0.2692953 -0.0004097 0.0026012 -0.1152288 -0.0768125 0.0106603 0.2512593 0.0049892 -0.1042334 0.0426801 -0.0301772 0.0114537 -0.0008531 0.060539 -0.0050306 -0.0607927 -0.0141014 0.1419708 0.0426641 -0.0301976 -0.0114368 -0.0006831 0.0606086 0.0051531 0.0607164 0.0144319 0.1419196 -0.0924144 -0.012749 -0.0421686 0.0218993 0.119732 -0.0187915 0.1108942 -0.0182965 0.0527774 0.0179728 0.0265911 0.0084442 0.0572535 0.0582367 0.0459475 0.0168606 0.0480199 0.0495433 0.0435358 -0.0195906 0.0235735 -0.0472163 0.0196678 -0.0271457 0.0306473 -0.0287658 0.0922312 0.0438769 -0.0195729 -0.0236026 -0.0472655 0.0197585 0.0272943 -0.0304934 0.028893 0.0920878 -0.0922847 -0.0129412 0.0421099 0.0211328 0.1198393 0.0186684 -0.1108943 0.0180567 0.0526311 0.0175964 0.0265546 -0.0084496 0.0571899 0.0580892 -0.0460151 -0.0170487 -0.048111 0.049784 unknown
polarizability: 509.1447532|-11.817777|197.9543969|0.0388123|-0.059314|138.6658319 unknown
InChI: InChI=1S/C6H2Cl2O2.2CH3O2S/c7-3-1-5(9)4(8)2-6(3)10;2*1-4(2)3/h1-2H;2*1H3
charge 0 multiplicity 1
26 atoms
Cl -1.262464 2.956423 0.698855
Cl 1.262516 -2.958639 0.703806
S  -3.921255 -0.04632 -0.892839
S  3.920968 0.04424 -0.892388
O  -2.763598 0.310269 0.837574
O  2.763672 -0.312421 0.837892
O  -3.817489 1.099322 -2.039793
O  -3.733127 -1.613608 -1.286012
O  3.82118 -1.103499 -2.0376
O  3.728238 1.61037 -1.288018
C  -1.423297 0.162065 0.750326
C  1.423342 -0.164188 0.750507
C  -0.543959 1.303066 0.719245
C  0.544021 -1.305261 0.721461
C  -0.840803 -1.149471 0.73636
C  0.840883 1.147327 0.734315
C  -5.51342 0.1962 0.119849
C  5.513414 -0.192087 0.121056
H  -1.513873 -2.01114 0.734948
H  1.51392 2.009013 0.731314
H  -6.348273 0.00743 -0.569249
H  -5.455005 -0.531425 0.938817
H  -5.476918 1.232964 0.477961
H  5.479165 -1.227956 0.481984
H  6.347955 -0.003462 -0.568463
H  5.453509 0.53759 0.93809
