program: Gaussian 09
title: 000269381
version: EM64L-G09RevD.01
frameworkgroup: C1[X(C14H12O)]
method: RPBEPBE
basis: SDD
operation: Freq
keyword: #pfreq=noraman
keyword: PBEPBE/SDD
title: #p freq=noraman PBEPBE/SDD
converged: NO NO NO NO
title: Mulliken charges:
elementType: O C C C C C C C C C C C C C C H H H H H H H H H H H H
charge: -0.268674 0.081748 -0.018692 0.165407 0.371526 0.163600 0.336194 -0.457443 -0.348407 -0.355605 -0.839339 -0.366475 -0.809932 -0.261340 -0.216274 0.226667 0.229596 0.242636 0.233210 0.232495 0.233242 0.253858 0.255931 0.231195 0.231331 0.225016 0.228528
chargesum: 0.00000
title: Mulliken charges with hydrogens summed into heavy atoms:
elementType: O C C C C C C C C C C C C C C
charge: -0.268674 0.081748 -0.018692 0.165407 0.371526 0.163600 0.336194 -0.230776 -0.118811 -0.112969 -0.140393 -0.112617 -0.091475 -0.036324 0.012254
polarizability: 2.33874553e+02 2.25040293e+00 1.67673252e+02 -1.40394364e-03 -1.69303290e-02 6.91550151e+01
1716.lowfreq: -59.3058 -0.0007 0.0001 0.0002 2.2040 3.9706 12.2551 96.8515 116.2133
frequency: -59.1321 96.8510 116.2115 131.4595 168.5301 171.4594 249.9452 279.4547 298.1156 330.9171 340.5476 418.1323 434.1658 479.0090 526.3306 536.3960 575.4800 578.6575 588.3086 628.7080 671.9037 731.7651 733.5203 756.2642 782.0942 811.5602 817.2826 862.8157 878.1747 938.6633 939.5868 942.3407 978.2446 998.8571 1014.5122 1029.9344 1043.5535 1046.2799 1083.3952 1120.5503 1160.9174 1167.5293 1192.9926 1230.6338 1253.0751 1268.4147 1300.8423 1362.4033 1391.5352 1400.9709 1401.5718 1411.0616 1442.3898 1460.9593 1469.7152 1470.8003 1480.5015 1481.3272 1512.1220 1585.9877 1596.7782 1621.1362 1643.3408 2966.7669 2981.7769 3040.9838 3057.0520 3081.5388 3100.0373 3118.9365 3134.0306 3142.8795 3150.2966 3166.2428 3175.4359
redmass: 1.0268 4.6726 2.9857 2.9086 3.6438 1.1063 2.7824 5.0264 4.9724 3.6442 3.8344 5.3587 3.0122 4.9581 4.3754 3.8188 3.6117 5.8875 4.0675 7.1111 6.5080 5.5468 4.0137 1.4444 3.9007 6.5911 1.2456 1.4229 6.3229 2.1639 1.3683 1.3429 1.3057 2.0628 1.9535 1.9408 1.5215 1.5055 2.7437 1.6892 1.5636 1.3134 2.5866 5.3470 2.1289 1.6246 2.0568 3.0575 4.7716 1.3670 1.2512 3.5304 3.2012 2.2543 1.0458 1.1918 1.0457 1.1623 3.5840 7.3784 7.1089 7.7375 8.2386 1.0380 1.0381 1.0974 1.0978 1.0977 1.0979 1.0871 1.0857 1.0961 1.0906 1.0953 1.0991
irintensity: 0.1864 2.1906 0.5644 2.7801 0.6043 1.1149 1.4983 0.0736 0.3517 1.2166 0.0343 2.9102 3.4493 0.3006 2.5930 6.6921 0.1982 2.1209 5.5660 1.6782 1.3752 1.5032 4.5491 87.1115 12.4769 12.2013 32.8922 0.3913 2.9339 9.5908 2.1015 0.7404 0.0690 15.2334 5.6103 9.6879 0.5270 13.2218 69.5273 11.5535 21.2869 0.6378 17.0926 34.6015 4.1658 1.5231 2.1840 17.8480 16.5632 14.3234 4.8483 11.5027 48.5515 1.4506 14.3501 0.1158 14.3992 28.2727 19.6022 8.5593 5.1779 0.5770 0.6162 28.2659 35.6279 19.5762 19.7477 26.3104 8.1952 10.9037 1.9407 30.9406 14.2134 19.1541 15.2147
temp: 298.150 k
press: 1.00000 atm
elementType: 8 6 6 6 6 6 6 6 6 6 6 6 6 6 6 1 1 1 1 1 1 1 1 1 1 1 1
symmnumber: 1
zpe: 565552.3 jmol-1
zpe.correction: 0.215407 hartree
zpe.thermalcorrener: 0.226923 hartree
zpe.thermalcorrenthalpy: 0.227868 hartree
zpe.thermalcorrgfe: 0.178348 hartree
zpe.sumelectzpe: -614.895770 hartree
zpe.sumelectthermal: -614.884254 hartree
zpe.sumelectthermalent: -614.883310 hartree
zpe.sumelectthermalfe: -614.932830 hartree
dipole: 0.1145 1.0216 0.0001
dipole: 1.0280
quadrupole: -74.5354 -78.8395 -92.9732
quadrupole: -0.5873 0.0010 -0.0027
quadrupole: 7.5806 3.2766 -10.8572 -0.5873 0.0010 -0.0027
hfenergy: -615.1111774 hartree
pointgroup: C01 [X(C14H12O1)]
dipole: -0.063159 0.399488 -0.0000199 debye
polarizability: 233.9426013|0.7448567|167.6052043|-0.002167|0.0168497|69.1550151 unknown
InChI: InChI=1S/C14H12O/c1-9-7-8-10(2)14-13(9)11-5-3-4-6-12(11)15-14/h3-8H,1-2H3
charge 0 multiplicity 1
27 atoms
O  0.130084 -1.7271 -0.000096
C  -0.422653 0.557483 0.00014
C  -0.928587 -0.77705 0.000045
C  1.036884 0.438105 0.000108
C  -1.331883 1.649536 0.000225
C  1.321488 -0.962293 -0.00004
C  -2.290027 -1.123029 0.000098
C  -2.710972 1.32698 0.000287
C  -3.175184 -0.014496 0.000263
C  2.124901 1.344947 0.000247
C  -0.852333 3.086903 0.000316
C  2.614423 -1.498496 -0.000115
C  -2.767965 -2.560967 -0.000146
C  3.441235 0.829593 0.000175
C  3.683914 -0.570806 -0.000016
H  -3.443298 2.142881 0.000367
H  -4.25509 -0.20698 0.000368
H  1.958766 2.426241 0.000444
H  -0.231259 3.307085 -0.889623
H  -1.701283 3.791707 -0.000633
H  -0.232918 3.307513 0.891318
H  2.783364 -2.578913 -0.000241
H  -1.919896 -3.264679 0.002729
H  -3.390542 -2.775169 0.888655
H  -3.385451 -2.776572 -0.892181
H  4.290645 1.521202 0.000279
H  4.714738 -0.941523 -0.000071
