program: Gaussian 09
title: 000269392
version: EM64L-G09RevD.01
frameworkgroup: C1[X(C16H11Br)]
method: RPBEPBE
basis: SDD
operation: Freq
keyword: #p
keyword: freq=noraman
keyword: PBEPBE/SDD
title: #p freq=noraman PBEPBE/SDD
converged: YES YES NO NO
title: Mulliken charges:
elementType: Br C C C C C C C C C C C C C C C C H H H H H H H H H H H
charge: 0.017513 0.102230 0.339815 0.333345 -0.391905 -0.437660 -0.419184 -0.378349 -0.423990 0.463488 -0.248418 -0.234716 -0.354985 -0.391746 -0.199289 -0.192870 -0.221468 0.242168 0.250615 0.222451 0.231615 0.245745 0.225622 0.225839 0.248679 0.240503 0.251925 0.253028
chargesum: 0.00000
title: Mulliken charges with hydrogens summed into heavy atoms:
elementType: Br C C C C C C C C C C C C C C C C
charge: 0.017513 0.102230 0.339815 0.333345 -0.149737 -0.187045 -0.196733 -0.146734 -0.178246 0.463488 -0.022796 -0.008877 -0.106307 -0.151243 0.052636 0.060158 -0.221468
polarizability: 4.48896267e+02 6.17132396e+00 1.75313825e+02 2.73749909e+00 2.79233675e+00 7.40577352e+01
1716.lowfreq: -0.0004 -0.0003 0.0003 2.1986 5.2746 12.3203 32.7090 33.6949 69.6786
frequency: 32.7051 33.6897 69.6651 107.1989 141.2235 164.5143 208.5186 219.0501 282.4277 313.0093 346.6313 368.5200 409.4534 422.9265 438.2556 507.8599 542.2199 564.6139 590.9578 621.2055 650.2084 662.8778 706.2172 720.1018 748.9228 763.7234 787.9144 805.4098 824.2967 828.8508 833.2988 853.0320 881.0336 907.5920 933.6210 946.2916 961.6831 970.9016 982.2943 993.0060 1016.1697 1028.6202 1062.1200 1075.9492 1113.9540 1118.3700 1169.3433 1191.8840 1192.2191 1204.6637 1252.3337 1278.4066 1299.9160 1320.9720 1350.6201 1386.7707 1399.3527 1413.7863 1446.2647 1457.4304 1474.2870 1514.8910 1560.5970 1588.7446 1595.4528 1614.1541 1633.1352 3085.7297 3118.2063 3128.4052 3132.2341 3142.5978 3158.9651 3161.9837 3171.5730 3175.2772 3181.1610 3214.5521
redmass: 7.3427 4.8010 4.7597 6.0418 7.1848 5.7207 5.5648 4.7422 5.7323 4.3419 5.8039 3.3215 2.9273 2.9865 4.2152 2.6549 6.8068 3.2172 6.8126 7.0106 4.1652 3.3535 3.9253 4.6710 2.5622 1.3262 3.8354 1.7019 3.2765 1.3850 1.6456 4.6767 1.4590 1.5984 1.3362 1.4489 1.3783 1.3886 1.3342 4.4033 2.7440 2.3118 2.5496 1.8341 1.3940 1.2962 1.0990 1.9923 1.1546 2.0261 2.0881 1.8710 1.3392 1.6484 4.0217 3.1890 3.2083 2.4690 2.6562 3.5590 2.5105 4.9544 7.1030 6.0617 6.6449 7.2340 7.7787 1.0875 1.0872 1.0883 1.0896 1.0940 1.0886 1.1001 1.0953 1.0913 1.0964 1.1016
irintensity: 0.0021 0.0852 0.0666 0.4815 0.4902 0.1730 1.0814 2.8699 3.0546 2.7220 9.0318 0.2315 0.1992 4.2814 5.7192 43.9701 1.4618 0.6080 3.5444 0.2332 0.2484 2.9310 2.1876 6.1991 9.9914 85.1559 8.3383 34.4700 31.9584 7.2010 50.0458 7.2882 1.1981 28.2195 0.5837 5.2817 3.4473 3.9957 0.1106 56.6628 13.7448 7.5675 49.3327 9.3946 3.6968 7.5248 4.2733 4.4748 0.1363 3.7205 2.9943 5.7098 0.2471 8.2466 1.9753 7.4704 5.0689 13.0274 18.4143 62.7345 163.5189 7.0520 0.2881 38.2018 2.3544 5.4989 22.5257 13.5354 5.1416 1.5112 7.6187 28.7039 3.2845 50.9969 9.6292 5.7115 1.4170 7.9551
temp: 298.150 k
press: 1.00000 atm
elementType: 35 6 6 6 6 6 6 6 6 6 6 6 6 6 6 6 6 1 1 1 1 1 1 1 1 1 1 1
symmnumber: 1
zpe: 559714.9 jmol-1
zpe.correction: 0.213184 hartree
zpe.thermalcorrener: 0.226770 hartree
zpe.thermalcorrenthalpy: 0.227715 hartree
zpe.thermalcorrgfe: 0.170637 hartree
zpe.sumelectzpe: -628.603638 hartree
zpe.sumelectthermal: -628.590052 hartree
zpe.sumelectthermalent: -628.589107 hartree
zpe.sumelectthermalfe: -628.646185 hartree
dipole: 1.0820 -0.4643 0.0035
dipole: 1.1774
quadrupole: -107.7363 -93.5707 -115.0443
quadrupole: 0.8815 0.4552 1.3932
quadrupole: -2.2859 11.8797 -9.5939 0.8815 0.4552 1.3932
hfenergy: -628.8168221 hartree
pointgroup: C01 [X(C16H11Br1)]
dipole: -0.4271551 0.1591824 -0.0823266 debye
polarizability: 448.7275677|4.9335637|149.7258842|-8.4803616|-44.1837263|99.8143755 unknown
InChI: InChI=1S/C16H11Br/c17-15-9-5-12(6-10-15)11-14-8-7-13-3-1-2-4-16(13)14/h1-11H
charge 0 multiplicity 1
28 atoms
Br 6.480253 -0.099487 0.046177
C  -2.22231 0.195075 -0.057767
C  -0.785167 -0.18947 0.047806
C  -3.008043 -0.915516 0.399302
C  -0.778761 -1.573101 0.571954
C  -2.07964 -1.997601 0.770346
C  0.264799 0.625777 -0.325461
C  -2.847988 1.380946 -0.481731
C  -4.414574 -0.840711 0.425935
C  1.711397 0.412683 -0.201184
C  -4.265694 1.454213 -0.457923
C  -5.039838 0.356208 -0.008979
C  2.311026 -0.465358 0.751439
C  2.582133 1.158926 -1.051276
C  3.709589 -0.617138 0.828206
C  3.982009 1.011105 -0.994255
C  4.533093 0.114858 -0.054345
H  0.112312 -2.184155 0.71339
H  -2.386012 -2.98474 1.124814
H  -0.009741 1.577237 -0.805795
H  -2.265186 2.243209 -0.826992
H  -5.017667 -1.685919 0.77613
H  -4.767286 2.370073 -0.789658
H  -6.132706 0.435419 0.003121
H  1.685393 -0.996445 1.473274
H  2.151369 1.855441 -1.780386
H  4.152611 -1.285112 1.572496
H  4.629724 1.583782 -1.663836
