program: Gaussian 09
title: 000269363
version: EM64L-G09RevD.01
frameworkgroup: C1[X(C15H19N3O3)]
method: RPBEPBE
basis: SDD
operation: Freq
keyword: #p
keyword: freq=noraman
keyword: PBEPBE/SDD
title: #p freq=noraman PBEPBE/SDD
converged: NO YES NO NO
title: Mulliken charges:
elementType: O O O N N N C C C C C C C C C C C C C C C H H H H H H H H H H H H H H H H H H H
charge: -0.422037 -0.275047 -0.265828 -0.196356 -0.485492 -0.000346 0.334702 -0.449100 -0.466105 -0.410065 -0.416047 -0.389421 -0.256076 0.254965 0.478067 -0.438469 -0.344926 -0.329419 -0.341202 0.317422 -0.537889 0.227093 0.223829 0.208338 0.294850 0.227826 0.208873 0.209446 0.227626 0.192258 0.209749 0.360673 0.342297 0.226360 0.299061 0.251449 0.241363 0.244379 0.221915 0.221283
chargesum: 0.00000
title: Mulliken charges with hydrogens summed into heavy atoms:
elementType: O O O N N N C C C C C C C C C C C C C C C
charge: -0.061364 -0.275047 -0.265828 -0.196356 -0.143195 -0.000346 0.334702 0.001822 0.037083 0.026634 0.021025 0.012587 -0.256076 0.254965 0.478067 -0.212109 -0.045865 -0.077971 -0.099838 0.317422 0.149688
polarizability: 3.01364506e+02 4.48749074e+00 1.75635582e+02 -1.87239477e-01 -5.20577145e+00 1.31707681e+02
1716.lowfreq: -6.8123 -1.9425 -0.0007 -0.0005 0.0008 14.0389 23.3051 31.2273 48.9132
frequency: 23.1490 30.3498 48.8253 64.8848 69.4540 98.4821 104.2860 114.8160 130.8211 164.2317 174.6050 189.2704 227.5136 235.0585 245.4790 249.0284 300.1357 318.9654 336.8270 349.3049 372.6906 390.9029 413.8919 421.2931 426.4883 451.6645 463.6869 507.3884 523.4071 526.2670 547.9092 569.1114 631.3278 632.2260 680.4326 682.9326 720.4742 738.8787 762.7174 786.6588 813.1344 815.5922 832.7512 836.3397 844.6816 875.2603 912.9462 932.3854 933.4817 941.9769 965.4038 969.7671 987.5213 997.4147 1005.8275 1061.3263 1065.7309 1079.7785 1102.1866 1113.9948 1118.7132 1142.0423 1153.8248 1158.5370 1179.2864 1185.8027 1212.6499 1224.8857 1256.7169 1264.6748 1267.5030 1274.5543 1307.7903 1311.8350 1322.7019 1333.5433 1339.0919 1345.3784 1357.3680 1378.8713 1422.5591 1438.4048 1460.3068 1464.7004 1465.5176 1467.1582 1473.5682 1475.3751 1481.7842 1502.0837 1515.7297 1593.5986 1625.6996 1631.2506 2165.4828 2958.2293 2972.4770 2981.0702 2981.7688 3002.2166 3007.6757 3037.9616 3041.8314 3045.1496 3050.7440 3083.8594 3114.5394 3119.6394 3124.2944 3158.0282 3170.0319 3192.9213 3329.6782 3496.2242
redmass: 4.6102 4.7543 5.4704 6.1702 5.0498 6.5218 3.7562 4.4416 4.2269 4.2903 3.7666 5.3952 2.6055 2.0859 1.5467 3.2516 5.6823 2.6038 6.3604 4.3609 4.5382 2.4547 2.9226 2.9919 2.0328 2.7299 2.7550 2.1383 2.4630 5.4139 7.6619 5.4000 3.9799 5.7116 4.3411 5.9192 3.4322 1.3952 5.0424 1.4884 1.8474 1.4161 1.6851 3.6090 5.9758 2.0134 2.7056 1.5645 2.2003 1.3667 1.3240 3.5749 7.9753 3.1531 2.9575 1.9429 2.1580 3.0430 1.4588 1.2596 1.3411 1.7071 2.4998 1.3295 1.4634 2.0457 1.9726 2.6171 1.3346 1.9411 1.4766 1.4356 1.3718 1.3125 1.2447 1.3540 1.3907 1.4746 1.4596 5.4356 3.8955 1.1775 1.0835 1.0825 1.0848 1.0498 1.0787 1.0821 1.0856 2.1955 2.3861 5.4482 8.5144 6.3826 12.6641 1.0331 1.0638 1.0633 1.0627 1.0668 1.0648 1.0953 1.0993 1.1039 1.1016 1.1003 1.0960 1.0900 1.0993 1.0895 1.0948 1.0948 1.0676 1.0757
irintensity: 1.1854 0.9703 1.2297 5.0480 0.1686 2.0518 6.8770 10.0446 0.1741 1.8136 5.6466 1.3373 11.9015 9.3739 1.6379 3.0469 5.1108 9.4501 6.4662 1.1259 8.3339 0.8547 2.8464 6.4093 39.5764 93.7083 35.0248 5.7904 22.7903 79.2588 17.2500 5.2501 3.8655 2.7700 6.7592 2.7702 3.0340 64.0208 32.7569 0.8567 8.8898 4.2380 103.0778 15.6733 4.6506 5.5584 12.7631 5.0347 5.0662 0.7124 3.1398 15.2982 40.8823 6.6089 16.6948 0.0685 6.0810 4.4458 0.0591 0.2236 13.8919 5.3167 6.5281 0.3115 254.4740 131.6541 86.3216 150.6186 5.7035 19.1571 26.6313 9.6508 13.6263 7.4057 29.3796 31.0994 0.5452 3.2402 2.8001 58.2355 52.4141 26.0481 8.4728 9.1950 7.8409 13.4680 51.8590 21.8421 8.8066 18.3576 868.6281 18.2851 207.2904 7.7090 2.1961 72.5362 36.9488 22.1596 24.5977 4.2080 16.9641 59.6947 35.0475 49.4961 62.1920 21.4485 6.1354 17.1390 26.9337 11.3513 6.2687 4.4274 2.0129 42.9532
temp: 298.150 k
press: 1.00000 atm
elementType: 8 8 8 7 7 7 6 6 6 6 6 6 6 6 6 6 6 6 6 6 6 1 1 1 1 1 1 1 1 1 1 1 1 1 1 1 1 1 1 1
symmnumber: 1
zpe: 843371.3 jmol-1
zpe.correction: 0.321223 hartree
zpe.thermalcorrener: 0.341696 hartree
zpe.thermalcorrenthalpy: 0.342640 hartree
zpe.thermalcorrgfe: 0.271209 hartree
zpe.sumelectzpe: -971.292139 hartree
zpe.sumelectthermal: -971.271666 hartree
zpe.sumelectthermalent: -971.270722 hartree
zpe.sumelectthermalfe: -971.342153 hartree
dipole: 0.2066 1.0347 -1.9901
dipole: 2.2525
quadrupole: -103.5166 -115.6671 -135.8118
quadrupole: 11.1162 -10.7387 3.8624
quadrupole: 14.8152 2.6647 -17.4800 11.1162 -10.7387 3.8624
hfenergy: -971.613362 hartree
pointgroup: C01 [X(C15H19N3O3)]
dipole: -0.0597256 0.6397979 0.6102581 debye
polarizability: 301.119865|-7.1606459|174.4782283|-1.0757528|-9.2468012|133.109676 unknown
InChI: InChI=1S/C15H19N3O3/c1-21-13-7-5-12(6-8-13)17-14(19)18(20)15(11-16)9-3-2-4-10-15/h5-8,17,20H,2-4,9-10H2,1H3
charge 0 multiplicity 1
40 atoms
O  -1.468131 2.036217 -0.764157
O  -0.301056 -1.136738 0.455465
O  6.32583 -0.178387 0.030866
N  -1.569908 0.833297 0.08647
N  0.771397 0.913562 -0.029097
N  -3.010716 -1.09832 -2.389339
C  -2.906172 0.153106 -0.009388
C  -4.022396 1.250623 0.031353
C  -3.118244 -0.821305 1.194894
C  -5.44024 0.638435 0.031184
C  -4.54002 -1.428811 1.196255
C  -5.638333 -0.342718 1.207415
C  -2.979979 -0.574743 -1.316489
C  -0.328244 0.095085 0.169554
C  2.148289 0.54922 0.011829
C  3.099683 1.587332 -0.19338
C  2.605181 -0.772977 0.234181
C  4.47557 1.312086 -0.179763
C  3.990336 -1.050362 0.245588
C  4.930741 -0.012526 0.038945
C  6.842707 -1.531135 0.247457
H  -3.90346 1.94804 -0.814211
H  -3.85135 1.830799 0.958251
H  -2.959204 -0.219652 2.111207
H  -2.351385 -1.608422 1.172439
H  -5.618887 0.111228 -0.927352
H  -6.178769 1.460568 0.082597
H  -4.634624 -2.086851 2.080523
H  -4.666241 -2.07665 0.305618
H  -5.59419 0.216456 2.164616
H  -6.640025 -0.809077 1.151663
H  -1.472089 1.716787 -1.718524
H  0.550075 1.897284 -0.213029
H  2.759433 2.616733 -0.363098
H  1.879776 -1.57214 0.396952
H  5.213659 2.104209 -0.335992
H  4.316117 -2.080485 0.417608
H  7.937156 -1.431729 0.201848
H  6.498052 -2.225929 -0.543387
H  6.544759 -1.922812 1.239823
