program: Gaussian 09
title: 000269347
version: EM64L-G09RevD.01
frameworkgroup: C1[X(C14H13N3)]
method: RPBEPBE
basis: SDD
operation: Freq
keyword: #pfreq=noraman
keyword: PBEPBE/SDD
title: #p freq=noraman PBEPBE/SDD
converged: YES YES NO NO
title: Mulliken charges:
elementType: N N N C C C C C C C C C C C C C C H H H H H H H H H H H H H
charge: -0.453630 -0.056060 -0.694138 -0.636783 0.163392 0.283583 0.460948 -0.011098 -0.377458 -0.355827 -0.434766 -0.345914 -0.216777 -0.407863 -0.409235 -0.234902 0.477011 0.234001 0.250076 0.325578 0.231094 0.240056 0.232609 0.246529 0.220974 0.217728 0.217069 0.222710 0.305264 0.305828
chargesum: 0.00000
title: Mulliken charges with hydrogens summed into heavy atoms:
elementType: N N N C C C C C C C C C C C C C C
charge: -0.128052 -0.056060 -0.083046 -0.152707 0.163392 0.283583 0.460948 -0.011098 -0.146363 -0.115771 -0.202157 -0.099384 0.004197 -0.190135 -0.192166 -0.012191 0.477011
polarizability: 2.49283743e+02 9.39105582e+00 1.50085458e+02 -1.77883678e+01 -1.61297804e+00 1.17062976e+02
1716.lowfreq: -10.3046 -6.5358 -0.0008 -0.0008 -0.0006 1.9760 13.5677 24.7164 40.9997
frequency: 13.0291 24.2485 40.9974 120.2963 135.2914 217.5512 252.0856 274.5658 309.8790 321.5088 351.7493 372.0587 388.6506 409.7911 429.5802 439.3868 499.9613 506.6863 563.9423 582.6348 613.2900 625.7700 637.0637 654.1350 687.6364 730.9925 753.2871 772.2866 777.1182 816.4599 819.9945 829.8938 836.5943 856.9513 880.2190 921.5332 934.3582 946.8099 957.9455 968.1256 973.9789 1000.7542 1007.2158 1019.6912 1108.9700 1127.4485 1158.1588 1165.4552 1189.2520 1195.8733 1212.6605 1217.5161 1256.1447 1288.2110 1303.3473 1314.4751 1325.0332 1362.4223 1384.8582 1411.9677 1433.8062 1443.0513 1457.6255 1474.6723 1517.0963 1520.3117 1580.3542 1592.5739 1632.6896 1633.1996 1645.5269 2982.9758 3043.2889 3110.8530 3113.1998 3126.8671 3132.9414 3139.6490 3139.7120 3155.0798 3169.2769 3566.4247 3583.5949 3706.4163
redmass: 3.9018 4.3679 5.0779 4.7734 5.1811 5.3658 4.6316 3.1896 3.5528 3.2073 1.3505 1.0543 2.5694 2.6726 3.0166 4.5854 5.2115 3.0251 4.5804 3.6890 6.2342 1.8620 2.8022 3.2005 3.6251 3.7602 1.3266 3.6561 3.8224 3.7466 1.2874 2.3344 3.7375 1.5235 5.3764 1.7433 1.3835 1.5271 1.3709 5.7527 1.3016 2.8399 2.1101 1.4331 1.6298 1.2538 1.1455 1.2312 1.1137 1.9484 2.2973 1.7171 2.5518 2.2308 1.8905 3.1520 1.3234 2.8914 5.3482 2.8830 3.1231 3.6003 1.1267 3.5075 5.1102 3.0655 6.6340 6.9607 4.8405 2.7783 1.7109 1.0639 1.0959 1.0869 1.0869 1.0852 1.0962 1.0971 1.0905 1.0957 1.0992 1.0449 1.0812 1.1040
irintensity: 0.1736 1.8794 0.3787 4.7361 3.1605 2.5464 4.6441 4.9468 1.1982 9.7690 303.4993 2.9265 1.8781 0.3487 7.9593 5.6743 1.1352 29.3759 5.4904 1.4112 1.1708 34.9210 18.1901 20.1818 5.5942 2.9930 111.1224 4.6615 11.2153 18.2019 0.9430 34.1966 20.4365 0.1960 2.7325 2.9209 3.9492 0.5033 0.1705 2.1410 0.0642 1.0171 6.5957 0.0963 4.2535 19.7186 2.7964 12.1353 20.7453 29.3892 0.4885 6.0556 26.9894 39.9062 7.7682 76.1170 5.4229 56.4976 12.6059 1.9576 1.4420 52.8322 12.3226 0.8024 107.4397 117.1400 5.1636 1.6813 17.5239 1.3552 289.3101 21.4244 5.4168 6.3805 29.0467 0.3471 40.5288 1.3506 14.1283 27.3692 23.9474 78.1503 50.2617 20.9898
temp: 298.150 k
press: 1.00000 atm
elementType: 7 7 7 6 6 6 6 6 6 6 6 6 6 6 6 6 6 1 1 1 1 1 1 1 1 1 1 1 1 1
symmnumber: 1
zpe: 629229.6 jmol-1
zpe.correction: 0.239661 hartree
zpe.thermalcorrener: 0.253574 hartree
zpe.thermalcorrenthalpy: 0.254518 hartree
zpe.thermalcorrgfe: 0.196646 hartree
zpe.sumelectzpe: -704.387676 hartree
zpe.sumelectthermal: -704.373763 hartree
zpe.sumelectthermalent: -704.372819 hartree
zpe.sumelectthermalfe: -704.430691 hartree
dipole: 4.9683 3.5348 -1.0755
dipole: 6.1916
quadrupole: -79.2488 -97.8439 -95.7602
quadrupole: 4.9321 -1.0580 2.1817
quadrupole: 11.7022 -6.8930 -4.8092 4.9321 -1.0580 2.1817
hfenergy: -704.6273372 hartree
pointgroup: C01 [X(C14H13N3)]
dipole: 1.8428368 1.3037012 0.9155106 debye
polarizability: 244.8683211|30.1570872|133.5837048|-3.2482468|15.8521913|137.9801509 unknown
InChI: InChI=1S/C14H13N3/c15-11-7-5-10(6-8-11)9-14-16-12-3-1-2-4-13(12)17-14/h1-8,16H,9,15H2
charge 0 multiplicity 1
30 atoms
N  -0.883617 0.486113 -0.193646
N  -1.712994 -1.399857 -1.173566
N  5.2261 1.072598 1.41313
C  0.709655 -0.830008 -1.683878
C  -0.628482 -0.619569 -1.019675
C  -2.221796 0.414579 0.217799
C  1.897153 -0.322091 -0.871208
C  -2.73033 -0.775031 -0.412321
C  -3.018439 1.23143 1.046501
C  2.202812 -0.878014 0.400255
C  2.734926 0.714417 -1.35317
C  -4.075903 -1.158157 -0.210404
C  -4.359357 0.830584 1.233953
C  3.297682 -0.42454 1.158503
C  3.836922 1.182807 -0.607337
C  -4.879812 -0.344799 0.615509
C  4.137935 0.618159 0.665116
H  0.698522 -0.33014 -2.672944
H  0.790568 -1.912863 -1.890511
H  -0.182482 1.169729 0.089751
H  -2.627005 2.135965 1.524389
H  1.572567 -1.682922 0.799128
H  2.527436 1.161449 -2.333888
H  -4.468604 -2.061341 -0.687552
H  -5.01681 1.435791 1.868264
H  3.512099 -0.87612 2.135244
H  4.468806 1.984261 -1.00969
H  -5.9268 -0.617286 0.788687
H  5.834192 1.803821 1.056817
H  5.447253 0.660035 2.314441
