program: Gaussian 09
title: 000269385
version: EM64L-G09RevD.01
frameworkgroup: C1[X(C17H14N2O8)]
method: RPBEPBE
basis: SDD
operation: Freq
keyword: #p
keyword: freq=noraman
keyword: PBEPBE/SDD
title: #p freq=noraman PBEPBE/SDD
converged: YES YES NO NO
title: Mulliken charges:
elementType: O O O O O O O O N N C C C C C C C C C C C C C C C C C H H H H H H H H H H H H H H
charge: -0.287778 -0.276559 -0.241198 -0.246525 -0.199280 -0.201085 -0.197701 -0.196535 0.021947 0.021553 -0.413370 -0.319386 -0.262804 0.265188 0.258250 0.203199 0.197888 -0.451451 -0.450735 -0.346618 -0.347244 0.388518 0.388338 -0.180521 -0.182296 -0.350795 -0.352638 0.256327 0.251930 0.252859 0.233034 0.228876 0.248002 0.320585 0.322827 0.281880 0.280987 0.248863 0.247880 0.293035 0.292553
chargesum: 0.00000
title: Mulliken charges with hydrogens summed into heavy atoms:
elementType: O O O O O O O O N N C C C C C C C C C C C C C C C C C
charge: -0.287778 -0.276559 -0.241198 -0.246525 -0.199280 -0.201085 -0.197701 -0.196535 0.021947 0.021553 0.094887 0.166507 0.214074 0.265188 0.258250 0.203199 0.197888 -0.130866 -0.127908 -0.064738 -0.066257 0.388518 0.388338 0.068342 0.065583 -0.057759 -0.060085
polarizability: 2.84239318e+02 -3.65403723e+01 2.31963200e+02 -1.67023750e+00 -1.77453884e+01 1.89740625e+02
1716.lowfreq: -5.1474 -0.0006 -0.0005 0.0005 2.5687 4.4613 8.3875 12.8447 13.7401
frequency: 6.9484 12.8207 13.5976 34.4440 38.0569 49.8240 58.0796 62.9919 69.0223 97.9891 105.4728 119.1642 151.7192 158.9488 184.8297 188.6283 206.5412 233.0083 241.9687 293.1786 318.0281 323.6030 333.2086 349.4473 365.4548 404.5685 423.1441 424.3091 440.4655 461.1159 467.0115 477.6349 524.5577 532.6566 550.7932 643.5100 644.5442 654.6155 655.0311 680.4434 682.7847 696.2171 696.9974 739.0604 740.6503 743.5087 752.0567 782.1453 833.4820 834.0965 834.6134 846.9156 869.3438 895.4540 946.5579 966.1289 967.4516 973.2940 973.6891 989.7895 989.9566 1015.6179 1015.6863 1017.2173 1049.0882 1057.5557 1084.0056 1084.8895 1097.4500 1101.5630 1104.7222 1124.0091 1173.4346 1174.2237 1209.3110 1211.8814 1219.0194 1244.8249 1249.7628 1255.4026 1285.2845 1286.0397 1293.7210 1330.3872 1362.8357 1374.8367 1375.2650 1383.1060 1400.3767 1401.2045 1431.4742 1432.1348 1453.1992 1455.6215 1469.0427 1472.9869 1473.6757 1582.2612 1583.0241 1614.9675 1615.0727 1624.5197 1627.5622 3011.0508 3029.7279 3036.0065 3073.3187 3111.9324 3122.3853 3154.1229 3154.8869 3170.7455 3171.4012 3187.3328 3187.9978 3198.1760 3198.8302
redmass: 9.1045 7.6110 7.9085 7.2230 8.3868 10.2632 10.1687 10.8367 9.3320 4.4376 5.9687 5.6850 5.4454 3.9974 4.3502 4.6652 6.2788 6.1841 4.6985 4.2259 5.3661 6.5168 3.6166 8.8279 6.9426 5.6810 3.1795 3.2683 7.4011 6.1832 5.7998 5.9489 5.6409 5.9907 3.9436 7.0182 7.0956 5.9221 5.8470 7.6737 7.4056 2.4816 2.4663 4.7931 6.5187 4.0404 6.8203 2.2296 2.1083 2.3525 1.5488 4.0032 3.1870 2.9638 4.2483 1.4861 1.4745 1.3815 1.3834 6.2658 6.2525 1.3715 1.3691 2.5174 3.2425 2.5534 1.9747 1.9674 2.4624 1.9686 2.1175 2.1925 1.1640 1.1574 5.2033 6.2111 1.2901 3.8581 3.5618 1.2033 1.4455 1.4603 1.1056 1.2922 1.3047 9.3164 9.9390 1.4218 7.6486 7.7964 3.1788 3.1532 1.1120 1.1088 1.1517 2.6896 2.3932 7.1513 7.1162 7.1017 7.0859 9.8474 10.0459 1.0608 1.0616 1.0588 1.1000 1.1085 1.1057 1.0882 1.0882 1.0941 1.0942 1.0973 1.0973 1.0928 1.0927
irintensity: 0.5478 0.8506 0.4782 0.4403 0.6369 0.8729 0.3529 2.4841 3.3523 1.8019 3.5939 0.9020 1.0913 2.1598 3.3320 0.2277 6.1520 1.7593 3.4574 11.1715 3.0346 12.0279 14.4219 0.5251 3.6550 2.3688 0.5568 0.3195 4.6662 1.2266 0.7179 1.5414 2.8182 1.1635 1.0844 1.8534 4.1238 2.0027 5.2653 28.0765 29.1088 55.9271 60.9093 16.6318 10.8083 3.1285 5.1678 8.9980 30.6688 11.1475 26.7253 10.0906 4.3217 39.0521 22.3340 12.2687 14.0317 3.1474 5.5498 4.6916 2.1760 1.0115 1.1283 17.3136 430.5576 50.5417 87.7026 28.0315 7.7979 101.0854 53.2508 54.8616 30.5925 27.5847 297.0687 267.3859 2.5444 449.9103 53.1516 7.1030 48.2147 14.9568 14.6980 13.8708 0.7748 93.3649 137.0003 1.9887 4.6799 3.9630 30.1144 26.6560 16.6751 14.2748 29.0966 3.3824 2.1351 6.7817 5.1950 12.0032 9.2432 178.7329 178.2922 3.3443 27.8172 26.6032 8.5777 6.7956 12.7767 3.3393 3.0778 5.9614 5.4432 2.7680 2.5892 8.9086 8.1398
temp: 298.150 k
press: 1.00000 atm
elementType: 8 8 8 8 8 8 8 8 7 7 6 6 6 6 6 6 6 6 6 6 6 6 6 6 6 6 6 1 1 1 1 1 1 1 1 1 1 1 1 1 1
symmnumber: 1
zpe: 767893.4 jmol-1
zpe.correction: 0.292475 hartree
zpe.thermalcorrener: 0.316746 hartree
zpe.thermalcorrenthalpy: 0.317690 hartree
zpe.thermalcorrgfe: 0.231748 hartree
zpe.sumelectzpe: -1365.416852 hartree
zpe.sumelectthermal: -1365.392582 hartree
zpe.sumelectthermalent: -1365.391637 hartree
zpe.sumelectthermalfe: -1365.477580 hartree
dipole: 0.6619 -4.2006 -2.0375
dipole: 4.7154
quadrupole: -144.0486 -169.6931 -166.6225
quadrupole: -16.4111 29.5593 -5.0846
quadrupole: 16.0728 -9.5717 -6.5011 -16.4111 29.5593 -5.0846
hfenergy: -1365.7093274 hartree
pointgroup: C01 [X(C17H14N2O8)]
dipole: 1.7242447 0.0295121 -0.6839351 debye
polarizability: 229.3864497|42.0754468|275.7875281|9.1237347|-24.6359732|200.7691662 unknown
InChI: InChI=1S/C17H14N2O8/c20-16(12-4-1-6-14(10-12)18(22)23)26-8-3-9-27-17(21)13-5-2-7-15(11-13)19(24)25/h1-2,4-7,10-11H,3,8-9H2
charge 0 multiplicity 1
41 atoms
O  2.012924 -2.275242 0.718387
O  0.919108 1.866898 0.022107
O  2.116577 -3.211683 -1.419465
O  2.803639 3.164886 0.488342
O  -2.469016 -5.658621 3.620861
O  -2.918027 5.833439 -3.057583
O  -1.061118 -3.923659 4.078611
O  -2.886146 3.654467 -2.384888
N  -1.542611 -4.823719 3.289986
N  -2.354224 4.825328 -2.481729
C  2.484538 -0.040053 -0.284902
C  3.087569 -1.306556 0.336837
C  1.562248 0.701386 0.694843
C  0.534985 -4.092091 0.215031
C  0.914083 4.147413 -0.701702
C  1.615133 -3.178347 -0.269791
C  1.657321 3.048347 -0.011252
C  0.021345 -4.008415 1.529892
C  -0.370507 3.943685 -1.257276
C  0.026501 -5.061697 -0.688734
C  1.535377 5.420542 -0.790362
C  -0.996122 -4.904911 1.907857
C  -1.002887 5.029603 -1.89202
C  -0.99376 -5.947497 -0.282287
C  0.877024 6.491394 -1.431316
C  -1.517381 -5.877201 1.025962
C  -0.404393 6.305147 -1.991291
H  1.930481 -0.304965 -1.202905
H  3.319596 0.624669 -0.576527
H  3.771539 -1.800464 -0.37404
H  3.604205 -1.100623 1.288629
H  2.124015 1.06512 1.574084
H  0.71466 0.075713 1.012849
H  0.401725 -3.272546 2.241166
H  -0.865122 2.971965 -1.198112
H  0.444783 -5.10168 -1.699683
H  2.530057 5.546117 -0.350472
H  -1.382344 -6.69246 -0.983126
H  1.360532 7.470846 -1.495417
H  -2.307884 -6.548339 1.372085
H  -0.941523 7.113108 -2.495051
