program: Gaussian 09
title: 000269349
version: EM64L-G09RevD.01
frameworkgroup: C1[X(C13H20N4O2)]
method: RPBEPBE
basis: SDD
operation: Freq
keyword: #p
keyword: freq=noraman
keyword: PBEPBE/SDD
title: #p freq=noraman PBEPBE/SDD
converged: YES YES NO NO
title: Mulliken charges:
elementType: O O N N N N C C C C C C C C C C C C C H H H H H H H H H H H H H H H H H H H H
charge: -0.306194 -0.277286 -0.108945 -0.197657 -0.212444 -0.649241 -0.118833 -0.425287 -0.424599 -0.405365 -0.418485 -0.380091 -0.284993 -0.033698 0.304613 0.215969 0.221893 -0.656407 -0.606651 0.205088 0.194275 0.210403 0.205564 0.197558 0.195874 0.217795 0.220644 0.197485 0.201547 0.184293 0.292321 0.237308 0.298082 0.237447 0.245812 0.245452 0.273798 0.335343 0.367613
chargesum: 0.00000
title: Mulliken charges with hydrogens summed into heavy atoms:
elementType: O O N N N N C C C C C C C C C C C C C
charge: -0.306194 -0.277286 -0.108945 -0.197657 -0.212444 0.053715 0.086255 -0.020608 -0.021477 0.008305 -0.000356 0.005749 0.007328 -0.033698 0.304613 0.215969 0.221893 0.116430 0.158410
polarizability: 2.71960879e+02 6.71530911e+00 1.83787450e+02 -3.02414536e+00 -1.42031549e-02 1.14274529e+02
1716.lowfreq: -13.6274 -3.5233 -0.0007 0.0003 0.0005 7.2781 11.0392 38.1917 52.9312
frequency: 8.8766 37.7926 52.8303 78.2903 88.6984 98.1214 121.1277 126.2602 174.5503 198.9041 199.8858 211.7983 225.9877 283.2407 288.5463 316.0879 322.1657 347.8618 352.6342 372.2702 383.2921 398.3944 412.1770 419.3136 446.0876 472.1771 489.7580 495.8739 578.5697 615.7811 645.9679 662.4952 706.7385 716.5852 739.9809 769.0009 778.2900 800.3901 827.3640 855.5162 865.5477 896.8723 923.7269 930.3209 971.8759 984.3164 1013.0143 1033.3900 1045.7115 1047.9816 1054.9696 1090.8012 1110.1816 1120.1101 1125.9051 1130.1579 1138.3696 1161.1457 1208.0275 1234.8206 1241.7101 1245.4985 1257.8826 1264.9841 1265.8078 1283.8677 1295.8479 1326.7778 1327.3537 1337.7075 1341.5696 1350.3569 1351.0761 1383.1255 1404.2297 1425.5719 1455.5448 1458.9057 1469.5338 1470.0013 1470.7992 1475.9613 1477.0610 1482.0238 1498.9464 1509.2401 1538.8773 1570.3743 1597.2487 1612.3713 1631.4642 2960.4607 2960.9048 2963.8732 2974.7596 2976.6407 2981.6566 2999.7006 3009.7264 3024.3465 3025.6407 3029.5955 3034.3594 3042.9142 3066.8818 3067.2497 3101.3846 3120.8318 3136.9860 3412.8612 3683.4205
redmass: 3.7954 4.1452 4.1804 3.3664 2.5607 1.3330 3.8948 3.7726 4.2488 1.2288 2.8520 3.5631 2.3134 2.7417 3.5850 2.2026 2.5319 2.8107 2.2812 1.5977 2.8344 7.9725 4.4316 3.2383 7.9104 1.9776 4.6746 5.0746 4.6137 2.9905 6.0091 6.4380 10.5143 3.5639 7.4595 1.2251 1.4903 3.5630 1.5218 2.4930 2.5615 2.7455 1.3535 4.0602 1.6064 1.7676 2.7760 2.6052 2.2680 1.5679 1.9023 1.6738 1.0944 2.1759 1.2953 1.3043 1.6307 2.2982 3.0988 1.5509 3.5891 2.7454 1.2944 3.2098 1.4954 1.4010 1.4651 1.8625 1.8423 1.4410 1.4521 1.4446 1.4639 1.7923 1.2348 1.3293 1.0836 1.0889 1.0854 1.1675 1.1032 1.0560 1.0534 1.0922 1.0495 1.3845 4.9029 5.5498 4.4179 7.6184 7.6536 1.0630 1.0631 1.0624 1.0633 1.0617 1.0354 1.0837 1.0328 1.0979 1.0966 1.0975 1.1035 1.1032 1.1033 1.0889 1.1023 1.0973 1.1019 1.0548 1.0934
irintensity: 0.6455 0.3290 0.4097 0.3332 0.4054 0.4644 7.8509 5.1355 0.7332 5.2258 0.1685 3.0447 1.4737 4.6799 13.0531 9.0811 12.9049 8.3041 10.6608 85.4015 19.7555 27.1239 2.3038 20.8397 5.0018 7.8259 13.1984 14.5930 1.5847 20.3992 16.1455 2.3858 2.9912 0.8902 2.3875 108.6231 0.0490 0.0404 11.2539 1.8669 6.8880 33.5024 0.5198 0.0593 30.2947 22.8410 14.7920 36.4501 12.1515 1.3927 6.9922 0.2459 1.0986 4.6482 0.1248 0.1141 1.0003 7.4516 48.0759 0.9920 14.2980 1.5272 0.2467 21.2560 3.7594 2.2520 4.5909 55.8142 57.9741 3.0434 28.9820 1.7809 0.5869 16.9704 13.7416 126.0252 6.6125 5.7711 10.3636 9.0216 10.2399 9.5105 10.2361 11.6600 20.3662 137.0290 107.6452 186.0291 430.8797 290.9032 585.8570 30.1702 48.2638 30.1555 21.6238 36.6778 49.2780 56.2110 34.8099 88.4840 92.4617 4.4921 0.8419 138.5200 23.8213 9.4146 19.1840 1.5113 0.8597 89.8547 95.9342
temp: 298.150 k
press: 1.00000 atm
elementType: 8 8 7 7 7 7 6 6 6 6 6 6 6 6 6 6 6 6 6 1 1 1 1 1 1 1 1 1 1 1 1 1 1 1 1 1 1 1 1
symmnumber: 1
zpe: 852954.4 jmol-1
zpe.correction: 0.324873 hartree
zpe.thermalcorrener: 0.343858 hartree
zpe.thermalcorrenthalpy: 0.344802 hartree
zpe.thermalcorrgfe: 0.276310 hartree
zpe.sumelectzpe: -875.424562 hartree
zpe.sumelectthermal: -875.405577 hartree
zpe.sumelectthermalent: -875.404633 hartree
zpe.sumelectthermalfe: -875.473125 hartree
dipole: -0.2555 -4.9241 0.0244
dipole: 4.9308
quadrupole: -114.3809 -101.9777 -114.6238
quadrupole: 12.4337 0.1860 0.0494
quadrupole: -4.0534 8.3498 -4.2963 12.4337 0.1860 0.0494
hfenergy: -875.7494351 hartree
pointgroup: C01 [X(C13H20N4O2)]
dipole: 0.0535723 -1.6357763 -1.0414559 debye
polarizability: 269.8084034|16.6272329|165.5548542|-0.7850018|31.7438338|134.6595996 unknown
InChI: InChI=1S/C13H20N4O2/c1-16-11(14)10(12(18)17(2)13(16)19)15-8-9-6-4-3-5-7-9/h8-9H,3-7,14H2,1-2H3
charge 0 multiplicity 1
39 atoms
O  -0.366597 1.560204 1.205453
O  -4.805481 0.121897 0.706325
N  0.54872 -0.812131 -0.44702
N  -3.104857 -1.154633 -0.288849
N  -2.588075 0.82974 0.943697
N  -1.357521 -2.42793 -1.298459
C  2.987264 -0.630671 -0.565771
C  3.797682 -1.25109 0.619398
C  3.816291 0.51249 -1.228552
C  4.283783 -0.191805 1.637817
C  4.312972 1.569327 -0.210414
C  5.113143 0.912809 0.940048
C  1.627726 -0.143798 -0.111926
C  -0.76631 -0.456512 -0.074819
C  -1.754153 -1.349896 -0.55607
C  -1.159735 0.691646 0.715389
C  -3.5711 -0.042037 0.477542
C  -4.12037 -2.099587 -0.791769
C  -3.0618 1.986355 1.73721
H  2.807847 -1.428243 -1.313861
H  4.682177 -1.768548 0.191855
H  3.18377 -2.02189 1.123624
H  3.217632 0.997038 -2.02419
H  4.696888 0.052954 -1.723929
H  4.88825 -0.682835 2.42526
H  3.413344 0.268162 2.146774
H  3.45025 2.120837 0.213515
H  4.93975 2.319008 -0.731638
H  5.425229 1.680167 1.674656
H  6.041635 0.464001 0.528126
H  1.564031 0.768958 0.500904
H  -4.115816 -2.133097 -1.896728
H  -5.09916 -1.731824 -0.449947
H  -3.953971 -3.112428 -0.381075
H  -3.612003 1.636472 2.626049
H  -3.739644 2.610261 1.131503
H  -2.170583 2.558559 2.033163
H  -1.988936 -3.120721 -1.685058
H  -0.33777 -2.464509 -1.429533
