program: Gaussian 09
title: 000269362
version: EM64L-G09RevD.01
frameworkgroup: C1[X(C20H12N6O2S2)]
method: RPBEPBE
basis: SDD
operation: Freq
keyword: #p
keyword: freq=noraman
keyword: PBEPBE/SDD
title: #p freq=noraman PBEPBE/SDD
converged: YES YES NO NO
title: Mulliken charges:
elementType: S S O O N N N N N N C C C C C C C C C C C C C C C C C C C C H H H H H H H H H H H H
charge: 0.534988 0.534988 -0.259241 -0.259238 -0.470071 -0.470075 -0.468104 -0.468106 -0.396704 -0.396704 0.275319 0.275343 0.462359 0.462363 -0.082462 -0.082472 0.128114 0.128103 -0.364900 -0.341453 -0.341466 -0.364870 0.161576 0.161575 -0.354521 -0.354524 -0.338304 -0.338305 -0.169578 -0.169576 0.364860 0.364856 0.279978 0.223365 0.223375 0.279973 0.316356 0.316357 0.262687 0.262686 0.235726 0.235726
chargesum: 0.00000
title: Mulliken charges with hydrogens summed into heavy atoms:
elementType: S S O O N N N N N N C C C C C C C C C C C C C C C C C C C C
charge: 0.534988 0.534988 -0.259241 -0.259238 -0.105211 -0.105218 -0.468104 -0.468106 -0.396704 -0.396704 0.275319 0.275343 0.462359 0.462363 -0.082462 -0.082472 0.128114 0.128103 -0.084921 -0.118088 -0.118091 -0.084897 0.161576 0.161575 -0.038165 -0.038167 -0.075617 -0.075619 0.066148 0.066149
polarizability: 5.99425838e+02 -4.29754924e+00 3.44217932e+02 -2.35531157e-03 9.31489153e-04 1.29537463e+02
1716.lowfreq: -5.1619 -3.6044 -1.9932 -0.0014 0.0009 0.0014 5.8908 18.6815 21.9576
frequency: 5.8897 18.6114 21.9490 36.7416 43.6296 48.9999 80.6554 83.6931 98.3151 137.2854 146.5314 167.0053 173.0580 201.7836 203.4791 216.4192 240.3183 246.0108 284.7687 299.1184 306.9721 319.7941 395.3188 402.7833 403.1682 426.0817 439.5909 440.7869 470.9878 477.3587 498.1348 505.4479 537.4764 537.6916 555.1681 555.8254 592.9883 600.2364 603.8650 613.4877 630.1742 634.3679 638.1560 672.0280 694.5121 705.4177 723.0100 723.8318 738.2039 743.4348 746.4374 754.7752 756.4958 774.6845 782.8256 801.6890 801.6966 841.3297 842.2776 852.7564 865.4945 871.5213 883.7694 925.9037 925.9664 987.7622 987.9035 989.6905 997.3040 1000.6423 1012.6509 1028.0801 1046.1045 1047.8513 1114.2809 1119.1230 1129.9181 1177.1337 1178.1197 1201.8695 1251.8810 1256.2566 1279.7949 1282.8088 1292.4011 1292.4967 1315.5422 1315.8300 1319.3940 1355.7914 1357.2184 1373.4969 1408.5592 1426.6405 1429.6934 1463.2734 1463.8130 1494.3840 1518.1829 1520.4136 1538.4750 1540.3200 1552.7637 1587.0168 1603.6101 1610.3393 1612.2359 1619.4952 3126.6867 3127.9100 3148.8981 3148.9240 3165.1758 3168.0679 3190.3788 3190.3810 3199.7262 3199.7288 3480.4994 3480.5694
redmass: 13.1459 6.3993 7.0523 4.5007 8.0978 11.8521 8.7219 8.3778 9.5745 9.1709 6.9119 6.1871 5.9903 8.0893 8.1037 8.0689 6.8857 7.7871 4.6407 5.8537 9.3428 6.7917 3.7631 7.9337 4.4930 6.4804 8.7162 8.4134 5.5697 10.7529 8.3839 5.8363 3.7129 3.7070 8.7309 8.8238 7.6703 4.9482 4.8874 9.4810 7.1109 9.1429 8.6817 5.5791 2.9119 6.0366 13.4984 13.5404 1.6467 2.9302 2.5524 4.3489 1.3760 7.2300 4.0400 1.7657 1.7545 4.6435 5.4553 1.3631 2.2140 6.6183 4.9321 1.3448 1.3446 1.3345 1.3312 1.3903 1.3895 4.6444 5.4581 2.8000 2.1025 2.1904 2.6958 1.9635 1.4736 1.3507 1.3486 1.1628 2.9545 2.2722 2.0407 2.2111 5.2560 5.5721 2.6844 2.4322 1.4697 3.2182 3.2973 5.3970 3.9618 5.0305 5.9878 3.9786 4.0818 2.5570 2.9759 2.4693 6.0591 5.7831 5.5586 7.4255 8.1707 4.4097 3.9368 6.3554 1.0899 1.0894 1.0889 1.0890 1.0940 1.0953 1.0951 1.0951 1.0949 1.0949 1.0765 1.0765
irintensity: 0.0070 0.0759 0.0206 0.0091 0.0556 0.0172 4.0877 0.5069 8.5952 10.5007 0.0041 1.1820 1.5389 4.1039 0.9622 1.6840 4.6473 5.5981 12.3115 3.0349 1.4137 11.9006 0.5552 13.1532 0.7297 3.5969 0.4648 3.8419 0.3759 0.1098 50.6980 1.1731 0.0313 0.3754 0.1413 3.9629 1.5146 1.5912 9.7996 20.1744 0.1659 0.0406 20.0465 1.6827 4.6269 1.6943 47.7215 5.4811 14.9595 83.7950 0.9493 8.2400 104.5051 0.7180 1.5878 12.1612 137.7456 19.6486 1.4038 6.3394 36.5514 36.2491 5.5249 0.9870 16.9646 0.3018 8.0912 1.1573 1.6565 47.3993 0.0037 8.7321 0.3880 5.3242 0.0346 65.1750 28.5477 0.0436 7.7602 0.7908 0.1634 305.4799 0.2361 97.5094 0.4398 6.1812 164.2803 1.6049 1.0649 4.5480 0.0000 4.7253 51.9073 561.2970 13.0744 67.5193 0.5793 130.1947 21.2308 959.3159 697.1218 10.0829 1.9287 255.1987 9.2131 13.1450 0.6188 0.2650 37.7643 0.0086 28.7259 0.7575 4.9992 0.0137 3.6578 8.0299 4.9226 0.3978 57.4760 7.4114
temp: 298.150 k
press: 1.00000 atm
elementType: 16 16 8 8 7 7 7 7 7 7 6 6 6 6 6 6 6 6 6 6 6 6 6 6 6 6 6 6 6 6 1 1 1 1 1 1 1 1 1 1 1 1
symmnumber: 1
zpe: 756612.3 jmol-1
zpe.correction: 0.288178 hartree
zpe.thermalcorrener: 0.312404 hartree
zpe.thermalcorrenthalpy: 0.313348 hartree
zpe.thermalcorrgfe: 0.229611 hartree
zpe.sumelectzpe: -2042.347381 hartree
zpe.sumelectthermal: -2042.323155 hartree
zpe.sumelectthermalent: -2042.322211 hartree
zpe.sumelectthermalfe: -2042.405948 hartree
dipole: -0.0001 -0.0001 0.3052
dipole: 0.3052
quadrupole: -186.2063 -182.6276 -191.8677
quadrupole: -9.5034 0.0014 0.0002
quadrupole: 0.6943 4.2729 -4.9672 -9.5034 0.0014 0.0002
hfenergy: -2042.6355594 hartree
pointgroup: C01 [X(C20H12N6O2S2)]
dipole: 0.0000386 -0.0000926 -0.1200712 debye
polarizability: 599.1855106|-8.9299387|344.4582046|0.0336419|-0.1065931|129.5375177 unknown
InChI: InChI=1S/C20H12N6O2S2/c27-19(21-13-3-1-5-15-17(13)25-29-23-15)11-7-9-12(10-8-11)20(28)22-14-4-2-6-16-18(14)26-30-24-16/h1-10,21-22H
charge 0 multiplicity 1
42 atoms
S  6.954128 -2.747037 -0.987991
S  -6.952364 2.746979 -0.99156
O  2.888924 2.343264 0.756898
O  -2.887587 -2.3418 0.758761
N  3.761706 0.261944 0.145527
N  -3.760197 -0.261081 0.145102
N  5.526469 -1.763977 -0.5852
N  -5.524792 1.764233 -0.58769
N  8.158466 -1.461879 -0.717932
N  -8.156794 1.462147 -0.720363
C  1.335895 0.498459 0.4687
C  -1.334446 -0.497346 0.46888
C  5.135771 0.567514 0.116317
C  -5.134276 -0.566604 0.116092
C  5.999777 -0.528777 -0.269921
C  -5.998194 0.529363 -0.271263
C  2.709686 1.117157 0.477054
C  -2.708241 -1.116033 0.477499
C  0.232792 1.389732 0.483053
C  -1.086366 0.902137 0.479811
C  1.087812 -0.901012 0.481049
C  -0.231347 -1.388603 0.484468
C  7.457999 -0.350462 -0.339939
C  -7.45642 0.351059 -0.341235
C  5.734412 1.795236 0.417364
C  -5.733006 -1.794007 0.418264
C  8.034746 0.925189 -0.020015
C  -8.033259 -0.924256 -0.020138
C  7.166848 1.951184 0.346072
C  -7.165444 -1.949945 0.347004
H  3.550664 -0.701819 -0.136311
H  -3.549089 0.70241 -0.137619
H  0.440872 2.463864 0.508724
H  -1.906266 1.629073 0.518379
H  1.907703 -1.627903 0.52061
H  -0.439436 -2.462708 0.511216
H  5.101861 2.636295 0.705549
H  -5.100524 -2.634826 0.707299
H  9.117039 1.062217 -0.069959
H  -9.115555 -1.061277 -0.070042
H  7.580943 2.934474 0.594126
H  -7.579613 -2.932975 0.595965
