program: Gaussian 09
title: 000269331
version: EM64L-G09RevD.01
frameworkgroup: C1[X(C11H14O2)]
method: RPBEPBE
basis: SDD
operation: Freq
keyword: #pfreq=noraman
keyword: PBEPBE/SDD
title: #p freq=noraman PBEPBE/SDD
converged: YES YES NO NO
title: Mulliken charges:
elementType: O O C C C C C C C C C C C H H H H H H H H H H H H H H
charge: -0.271869 -0.265719 -0.531953 -0.360548 0.442434 0.015667 -0.343721 0.167292 -0.432432 -0.359043 -0.696903 -0.206654 -0.204588 0.213309 0.201662 0.223831 0.201807 0.195979 0.192947 0.236156 0.250810 0.212505 0.210841 0.215370 0.225977 0.238823 0.228022
chargesum: 0.00000
title: Mulliken charges with hydrogens summed into heavy atoms:
elementType: O O C C C C C C C C C C C
charge: -0.271869 -0.265719 -0.116982 0.065090 0.442434 0.015667 0.045204 0.167292 -0.196276 -0.108234 -0.058188 0.019324 0.262257
polarizability: 1.45919693e+02 8.42111014e-01 1.39653124e+02 -1.13844184e+01 -2.92099680e+00 7.98723347e+01
1716.lowfreq: -11.6917 -4.7130 -0.0006 0.0004 0.0006 8.0638 32.1173 63.4787 71.6313
frequency: 31.9450 63.4565 71.6178 98.4801 111.5535 167.6684 217.9614 231.4787 249.6501 255.1408 289.9631 381.7354 446.4126 510.7067 537.3850 569.7146 587.6138 650.0211 706.5200 725.5007 734.7003 769.8022 789.8928 805.4277 840.3884 878.4011 896.7043 917.5024 952.0272 954.9927 989.6669 1015.4790 1036.2563 1070.5234 1073.1463 1098.5620 1106.1968 1131.5515 1132.7732 1176.1860 1207.9135 1242.7234 1248.8915 1265.6146 1286.1887 1292.3877 1327.3614 1350.2281 1364.3681 1389.6445 1405.1006 1436.3513 1465.5124 1468.2526 1471.1210 1477.2040 1478.7059 1481.8883 1488.2423 1598.5392 1641.5282 2963.2059 2972.8115 2974.8623 2984.5162 2988.6186 3005.5663 3027.1919 3053.4588 3070.8979 3071.6328 3107.1219 3129.8926 3154.6256 3183.5892
redmass: 3.2890 3.4340 1.8627 2.3768 2.2922 5.1351 2.3328 1.5259 3.2618 2.9769 4.9790 3.0832 4.2573 4.9572 4.0178 5.1815 5.9073 6.0957 7.8853 3.0036 1.0867 1.4825 1.3758 4.0761 10.6340 1.4072 1.7635 1.3956 1.4376 3.0602 4.8199 3.6428 2.0851 2.5797 1.5113 1.5870 2.1713 1.2015 1.8084 1.3623 1.5024 2.2151 1.4700 1.4301 1.2539 1.1085 1.4444 1.5511 1.2649 1.2137 5.1447 3.2032 1.1791 1.0755 2.5506 1.0449 1.0687 1.1408 1.0871 7.9909 8.5707 1.0584 1.0390 1.0573 1.0597 1.0626 1.0987 1.1015 1.1043 1.1004 1.1000 1.1081 1.0877 1.0934 1.0969
irintensity: 0.0329 0.0399 0.0622 16.4256 0.2418 0.4649 0.4336 0.3130 0.4436 0.8290 0.9628 1.4675 4.6096 2.5780 0.4307 1.1517 0.5392 4.0979 4.8317 23.9696 8.0372 55.3829 6.5771 19.0305 23.2324 2.5650 0.9513 5.8744 3.4218 24.8782 95.2644 24.8974 18.1308 1.6748 8.2922 3.4285 14.4804 10.3778 17.9647 3.7903 3.0273 89.0535 17.9999 4.4477 12.3036 3.9454 4.6120 0.8183 0.2280 11.9432 5.3776 112.9902 4.3326 0.7213 18.8779 10.8454 5.1682 2.4966 18.4528 6.8054 11.8790 27.7308 27.7167 9.2951 74.2880 123.8644 8.3539 0.7669 25.7645 76.1543 70.4976 29.6854 6.4598 18.2287 7.0582
temp: 298.150 k
press: 1.00000 atm
elementType: 8 8 6 6 6 6 6 6 6 6 6 6 6 1 1 1 1 1 1 1 1 1 1 1 1 1 1
symmnumber: 1
zpe: 588266.4 jmol-1
zpe.correction: 0.224059 hartree
zpe.thermalcorrener: 0.236682 hartree
zpe.thermalcorrenthalpy: 0.237626 hartree
zpe.thermalcorrgfe: 0.183927 hartree
zpe.sumelectzpe: -577.014590 hartree
zpe.sumelectthermal: -577.001967 hartree
zpe.sumelectthermalent: -577.001023 hartree
zpe.sumelectthermalfe: -577.054722 hartree
dipole: -0.4491 -0.1384 0.5268
dipole: 0.7059
quadrupole: -77.9803 -68.8936 -80.0298
quadrupole: -1.3351 -0.0323 -1.6313
quadrupole: -2.3457 6.7410 -4.3953 -1.3351 -0.0323 -1.6313
hfenergy: -577.238649 hartree
pointgroup: C01 [X(C11H14O2)]
dipole: -0.1726353 0.0879843 -0.1989734 debye
polarizability: 145.643564|-2.5898205|139.5830469|11.5971684|4.4689155|80.2185406 unknown
InChI: InChI=1S/C11H14O2/c1-2-3-5-9-6-4-7-10-11(9)13-8-12-10/h4,6-7H,2-3,5,8H2,1H3
charge 0 multiplicity 1
27 atoms
O  0.457144 1.680076 -0.118243
O  2.70082 1.309145 0.635651
C  -1.53193 -0.500038 -0.940195
C  -2.454304 -0.055199 0.22956
C  -0.102707 -0.756342 -0.50172
C  0.762303 0.286382 -0.138801
C  -3.902868 0.219006 -0.232259
C  2.082226 0.072282 0.304824
C  0.455581 -2.065295 -0.392911
C  2.629098 -1.208001 0.420592
C  -4.820722 0.673673 0.923048
C  1.778233 -2.287772 0.05505
C  1.758096 2.347071 0.146316
H  -1.552114 0.2927 -1.714423
H  -1.946168 -1.416886 -1.401737
H  -2.033847 0.858988 0.69202
H  -2.454602 -0.838943 1.013531
H  -3.89056 0.995974 -1.024046
H  -4.319337 -0.696677 -0.700403
H  -0.170647 -2.920281 -0.672706
H  3.651895 -1.365614 0.771496
H  -4.441847 1.60491 1.384652
H  -4.871713 -0.096122 1.716072
H  -5.851092 0.865277 0.570829
H  2.161922 -3.31137 0.118309
H  1.620225 3.105768 0.931532
H  2.146516 2.769486 -0.800937
