program: Gaussian 09
title: 000269307
version: EM64L-G09RevD.01
frameworkgroup: C1[X(C12H16O4)]
method: RPBEPBE
basis: SDD
operation: Freq
keyword: #pfreq=noraman
keyword: PBEPBE/SDD
title: #p freq=noraman PBEPBE/SDD
converged: YES YES NO NO
title: Mulliken charges:
elementType: O O O O C C C C C C C C C C C C H H H H H H H H H H H H H H H H
charge: -0.326065 -0.438388 -0.417521 -0.231366 -0.374540 -0.566752 -0.358038 0.561633 -0.490279 -0.517542 -0.461266 0.155781 -0.322936 0.192696 0.173193 -0.523829 0.206399 0.210989 0.207078 0.208042 0.216282 0.217778 0.254713 0.252985 0.256023 0.231344 0.235719 0.378748 0.375206 0.225357 0.225797 0.242758
chargesum: 0.00000
title: Mulliken charges with hydrogens summed into heavy atoms:
elementType: O O O O C C C C C C C C C C C C
charge: -0.326065 -0.059640 -0.042314 -0.231366 0.042848 -0.151632 0.076022 0.561633 0.017418 -0.261519 -0.229922 0.155781 -0.087217 0.192696 0.173193 0.170084
polarizability: 2.04359227e+02 -2.78409778e-01 1.28586229e+02 -1.82194747e+01 1.15682460e+00 1.02508886e+02
1716.lowfreq: -7.2235 -3.0880 -0.0008 -0.0005 -0.0005 9.4533 12.6739 19.0603 33.3704
frequency: 12.6020 18.9063 33.2907 47.2723 76.1842 93.9166 106.7279 120.4115 150.8714 189.1109 215.4376 221.5728 253.6321 277.6332 318.0835 346.0008 405.6975 443.2271 454.4183 487.7246 497.8628 500.8752 520.0457 581.4040 584.3314 628.1783 639.0598 709.8773 728.6705 731.6775 740.7352 783.8408 797.9535 855.5623 880.2231 896.6191 916.5340 940.1014 996.2237 1015.2470 1026.7607 1066.0436 1070.0282 1089.8279 1116.6781 1116.9424 1129.5111 1145.8158 1156.0311 1192.1011 1222.7847 1226.6491 1233.9782 1257.0181 1264.2321 1281.6127 1285.4691 1301.0178 1315.6075 1345.7073 1372.3551 1400.0298 1436.8976 1437.9822 1461.7722 1464.0314 1465.8940 1471.9974 1476.1949 1486.6029 1497.6362 1597.2454 1631.8678 1669.5284 2963.7821 2967.5054 2978.5053 2986.8763 2995.1190 3009.1512 3028.7591 3041.1251 3052.7682 3062.5141 3125.8055 3129.2888 3148.5785 3159.0044 3511.7524 3512.8864
redmass: 10.5242 4.6502 5.1451 2.5404 3.5949 2.1323 5.6408 2.1038 3.8997 3.0507 2.4144 1.7891 4.8960 3.2790 4.8704 3.3589 4.6465 3.5423 3.5796 5.6162 1.1118 1.7950 4.1796 4.8408 4.7954 4.4173 1.3133 4.3129 2.8964 1.2669 4.6094 1.3071 1.4370 4.3942 1.5550 1.4782 1.3493 3.2545 8.1075 3.7643 3.3373 1.6009 2.6400 2.6348 1.5967 1.4792 1.5263 1.4586 1.3657 1.4889 1.6406 1.4542 1.3564 1.6386 2.3688 1.2543 1.0607 1.4168 1.6604 1.5424 1.8534 4.8511 1.2167 1.0853 2.5556 1.0509 1.0799 1.0970 1.1715 1.1025 2.8656 7.4918 6.6184 8.2194 1.0326 1.0591 1.0596 1.0614 1.0594 1.0992 1.0995 1.1032 1.1043 1.1034 1.0989 1.0893 1.0919 1.0950 1.0639 1.0645
irintensity: 1.1165 1.1169 0.4567 0.3682 5.2654 0.0896 1.1633 0.0457 1.7566 1.3190 0.0579 0.6204 1.4498 6.1645 1.6499 2.1307 7.4264 34.8230 5.3336 1.7641 139.6724 29.6324 13.1991 1.9782 17.4406 7.2207 128.4789 3.3586 23.4202 9.3181 16.7554 5.6194 35.2303 0.5048 18.1417 1.6300 0.4644 41.5707 55.1370 127.9001 84.7301 8.5670 54.9239 39.1495 21.4248 15.2419 25.1469 2.9853 45.7083 92.8256 66.6386 59.2494 9.0482 64.1990 78.3801 4.5667 1.1489 6.7111 40.9435 10.9538 35.0225 20.0854 20.8082 28.6448 15.4522 14.1894 2.0391 0.3756 47.0681 18.7957 151.7969 40.7348 2.4817 213.6121 66.1366 4.1669 40.6194 9.2090 46.1182 0.4221 1.7980 10.0654 46.1327 71.9745 30.7036 5.1442 9.2075 11.1494 18.7647 76.2087
temp: 298.150 k
press: 1.00000 atm
elementType: 8 8 8 8 6 6 6 6 6 6 6 6 6 6 6 6 1 1 1 1 1 1 1 1 1 1 1 1 1 1 1 1
symmnumber: 1
zpe: 679508.9 jmol-1
zpe.correction: 0.258811 hartree
zpe.thermalcorrener: 0.275807 hartree
zpe.thermalcorrenthalpy: 0.276751 hartree
zpe.thermalcorrgfe: 0.210390 hartree
zpe.sumelectzpe: -766.549920 hartree
zpe.sumelectthermal: -766.532925 hartree
zpe.sumelectthermalent: -766.531980 hartree
zpe.sumelectthermalfe: -766.598342 hartree
dipole: -2.3270 -2.4037 2.0461
dipole: 3.9216
quadrupole: -75.5478 -93.4465 -100.8995
quadrupole: 12.0308 1.9639 -1.8321
quadrupole: 14.4168 -3.4819 -10.9349 12.0308 1.9639 -1.8321
hfenergy: -766.8087314 hartree
pointgroup: C01 [X(C12H16O4)]
dipole: -0.8873501 -1.0966257 0.624918 debye
polarizability: 202.3539495|3.8882822|126.8495893|-22.7143492|6.4273041|106.2508028 unknown
InChI: InChI=1S/C12H16O4/c1-16-11-7-6-9(8-10(11)13)4-2-3-5-12(14)15/h6-8,13-14H,2-5H2,1H3
charge 0 multiplicity 1
32 atoms
O  -4.772526 0.060022 0.954494
O  -3.369676 2.332696 0.811234
O  6.462287 -0.043355 1.242908
O  5.970786 0.029413 -1.024427
C  1.651029 -0.034047 0.017589
C  0.604434 0.042506 -1.128636
C  3.102527 0.02724 -0.504091
C  -0.829168 0.003278 -0.619136
C  4.130448 -0.05693 0.63989
C  -1.453457 1.191035 -0.153568
C  -1.549985 -1.213738 -0.558256
C  -2.759937 1.156378 0.359586
C  -2.869196 -1.261969 -0.04182
C  -3.471358 -0.076431 0.417001
C  5.567055 -0.017457 0.157767
C  -5.590824 -1.147696 1.054572
H  1.491889 -0.971748 0.58787
H  1.468791 0.797523 0.728181
H  0.781115 -0.799415 -1.826468
H  0.779395 0.974082 -1.702466
H  3.259233 0.964582 -1.07215
H  3.282219 -0.796862 -1.221167
H  3.992556 0.769028 1.364927
H  3.9971 -0.988407 1.22527
H  -0.934353 2.154813 -0.191294
H  -1.082724 -2.136887 -0.92031
H  -3.406851 -2.214759 -0.008983
H  -4.285042 2.10668 1.12682
H  7.394948 -0.019878 0.894315
H  -5.112755 -1.896452 1.715174
H  -5.767722 -1.590665 0.055519
H  -6.545838 -0.82108 1.491654
