program: Gaussian 09
title: 000269314
version: EM64L-G09RevD.01
frameworkgroup: C1[X(C14H18Cl2N2O2)]
method: RPBEPBE
basis: SDD
operation: Freq
keyword: #p
keyword: freq=noraman
keyword: PBEPBE/SDD
title: #p freq=noraman PBEPBE/SDD
converged: YES YES NO NO
title: Mulliken charges:
elementType: Cl Cl O O N N C C C C C C C C C C C C C C H H H H H H H H H H H H H H H H H H
charge: -0.015164 -0.007816 -0.246115 -0.272454 -0.362848 -0.467348 -0.362141 -0.361933 -0.361057 -0.558982 -0.400640 0.210756 0.535967 0.251950 -0.459099 -0.349986 -0.767931 -0.026344 -0.181610 -0.121550 0.192961 0.183649 0.201769 0.247595 0.232281 0.200371 0.210273 0.237871 0.205721 0.261252 0.295976 0.309505 0.252322 0.318696 0.255426 0.206025 0.253635 0.259019
chargesum: 0.00000
title: Mulliken charges with hydrogens summed into heavy atoms:
elementType: Cl Cl O O N N C C C C C C C C C C C C C C
charge: -0.015164 -0.007816 -0.246115 -0.272454 -0.066872 -0.157843 0.014468 0.087432 0.071595 -0.110837 0.066332 0.210756 0.535967 0.251950 -0.206777 -0.031289 -0.052846 -0.026344 0.077408 -0.121550
polarizability: 3.04579859e+02 -1.27837856e+01 1.77765704e+02 8.51010828e+00 7.69691578e+00 1.19756762e+02
1716.lowfreq: -10.1852 0.0011 0.0014 0.0022 0.9873 3.7003 8.8553 12.3057 18.9167
frequency: 8.6377 12.2295 18.8696 29.3894 45.8624 59.7866 77.5498 82.6874 102.0445 110.5923 129.9062 141.0448 151.3357 156.6916 183.2065 199.4462 241.0643 250.7882 290.4209 320.6968 343.4816 347.7988 394.4981 424.5566 435.3501 439.9818 466.5378 492.1031 543.5225 567.7921 585.5389 592.8593 614.8099 643.3043 652.7094 676.2609 692.4984 729.1799 754.8607 761.1161 817.4995 836.8471 854.4530 862.8393 890.3810 910.2905 949.6566 969.0903 980.2217 985.6166 996.8629 1034.5542 1040.7687 1066.7566 1083.7861 1092.4691 1109.6653 1121.7183 1138.8963 1144.3890 1185.8326 1221.8818 1237.1906 1250.0946 1254.2590 1273.7961 1281.1113 1290.1471 1302.5876 1317.5866 1343.7968 1352.4400 1354.7540 1369.5911 1386.8078 1391.2388 1445.8268 1447.0444 1450.0311 1459.3379 1465.9374 1467.7900 1469.3456 1484.4208 1487.1423 1492.9192 1578.5245 1602.9824 1622.0884 1625.2484 2946.9459 2971.7591 2979.6212 2984.3322 2993.1653 2994.6020 2997.7708 3025.5706 3046.7427 3063.3098 3073.6919 3095.3273 3100.1134 3142.5835 3166.9833 3201.4469 3531.7462 3564.6565
redmass: 7.4818 4.7983 7.1197 6.5343 4.0648 8.0388 2.2551 1.4648 3.2514 2.1540 3.9797 3.7851 2.5756 4.9237 17.3890 6.2650 5.0352 8.7587 2.9604 3.6454 5.2425 4.8182 4.3023 3.0983 5.9954 3.1438 4.7815 2.1480 1.5012 4.0983 3.6905 3.3185 2.6430 1.3137 5.8972 5.9600 3.1098 1.1977 4.4940 1.4528 1.9135 1.3264 4.6063 1.6476 2.3772 2.1273 4.9850 2.0583 1.3127 1.7653 5.1279 3.2967 1.6463 2.6808 1.8052 2.3090 3.4753 2.2275 1.6072 1.3193 2.0478 1.2933 1.5026 1.6196 1.4910 1.3357 1.8945 1.0735 1.2231 1.4177 2.0188 1.7045 1.7734 1.3405 1.2283 5.6816 1.1421 1.1115 1.0469 1.0819 2.8366 1.0916 1.0839 1.1574 1.6533 2.3224 6.0636 6.5102 6.2310 4.7989 1.0589 1.0589 1.0626 1.0701 1.0647 1.0367 1.0883 1.0988 1.1004 1.1027 1.1006 1.1000 1.0984 1.0924 1.0911 1.0954 1.0765 1.0779
irintensity: 0.5379 0.2986 6.5658 1.1526 6.9673 5.8749 0.8563 3.3762 0.9326 2.8316 3.0220 2.8750 2.8753 2.0952 0.8686 1.4775 2.9705 1.0599 12.8190 1.5578 3.6925 0.3219 2.2269 7.7815 1.8664 6.7275 44.8729 11.3401 120.2052 13.1229 10.0610 4.3549 2.8322 48.1781 15.7853 10.2714 3.9912 10.8655 9.9253 2.1447 6.9057 15.1936 13.4501 66.0482 3.2465 3.3918 7.8317 14.3492 3.6348 0.0917 26.0880 0.7628 15.6548 4.6864 39.0496 0.3584 9.1787 69.9994 28.5030 6.1514 65.0786 17.8215 5.6332 53.3378 16.5760 73.9725 9.8541 4.3256 17.6411 27.1763 66.5763 73.9650 70.3512 1.5055 57.0174 9.3751 66.8195 11.3920 11.0279 3.6694 195.2191 39.9615 0.6880 61.1590 180.3235 338.7722 121.4158 59.8230 160.4914 116.0547 26.3929 13.6461 19.2160 33.5778 40.8507 15.2250 25.2298 9.4018 23.2281 70.9464 9.8226 20.6513 12.6812 4.2954 1.2748 11.4931 12.7899 10.9142
temp: 298.150 k
press: 1.00000 atm
elementType: 17 17 8 8 7 7 6 6 6 6 6 6 6 6 6 6 6 6 6 6 1 1 1 1 1 1 1 1 1 1 1 1 1 1 1 1 1 1
symmnumber: 1
zpe: 786245.0 jmol-1
zpe.correction: 0.299465 hartree
zpe.thermalcorrener: 0.321218 hartree
zpe.thermalcorrenthalpy: 0.322162 hartree
zpe.thermalcorrgfe: 0.242408 hartree
zpe.sumelectzpe: -1722.884505 hartree
zpe.sumelectthermal: -1722.862752 hartree
zpe.sumelectthermalent: -1722.861808 hartree
zpe.sumelectthermalfe: -1722.941562 hartree
dipole: 1.5599 4.8981 3.2302
dipole: 6.0711
quadrupole: -179.6944 -129.7268 -132.3829
quadrupole: 18.6817 23.1114 -0.9830
quadrupole: -32.4264 17.5412 14.8851 18.6817 23.1114 -0.9830
hfenergy: -1723.18397 hartree
pointgroup: C01 [X(C14H18Cl2N2O2)]
dipole: -0.604769 1.915795 1.2919943 debye
polarizability: 303.3131271|-7.9642128|133.5438125|19.6637862|25.1234033|165.2453857 unknown
InChI: InChI=1S/C14H18Cl2N2O2/c1-10(19)17-8-4-2-3-5-14(20)18-11-6-7-12(15)13(16)9-11/h6-7,9,17-18H,2-5,8H2,1H3
charge 0 multiplicity 1
38 atoms
Cl 6.739634 0.69428 1.998364
Cl 7.582386 -0.975169 -0.72112
O  0.622433 -0.495883 -1.362334
O  -7.483098 -1.031316 -0.679298
N  -6.209041 0.591796 0.394733
N  1.794643 0.404575 0.461889
C  -3.135454 0.183354 0.853302
C  -1.773185 -0.394851 0.411778
C  -4.237057 -0.89643 0.934439
C  -0.657884 0.678547 0.366025
C  -5.62083 -0.351532 1.362591
C  0.628399 0.136163 -0.265713
C  3.136541 0.060255 0.141215
C  -7.108922 0.176788 -0.578778
C  4.147815 0.464662 1.052536
C  3.496579 -0.659863 -1.030313
C  -7.618972 1.270506 -1.515453
C  5.495072 0.153985 0.797219
C  4.851964 -0.960177 -1.268686
C  5.857219 -0.559761 -0.364353
H  -3.441075 0.971087 0.133064
H  -3.03075 0.678489 1.84273
H  -1.473217 -1.210766 1.09959
H  -1.861128 -0.845539 -0.594198
H  -4.344687 -1.40148 -0.044565
H  -3.93502 -1.675967 1.66338
H  -0.475229 1.08715 1.379909
H  -1.003855 1.522011 -0.264969
H  -5.545404 0.151719 2.34635
H  -6.332372 -1.190675 1.453637
H  -5.931513 1.573007 0.426446
H  1.666312 0.91742 1.337105
H  3.895768 1.021198 1.961954
H  2.72063 -0.972115 -1.730217
H  -8.721355 1.292552 -1.473689
H  -7.23205 2.276659 -1.276268
H  -7.337573 1.01737 -2.55236
H  5.136377 -1.514147 -2.168046
