program: Gaussian 09
title: 000269289
version: EM64L-G09RevD.01
frameworkgroup: C1[X(C14H13BrO2S)]
method: RPBEPBE
basis: SDD
operation: Freq
keyword: #p
keyword: freq=noraman
keyword: PBEPBE/SDD
title: #p freq=noraman PBEPBE/SDD
converged: YES YES NO NO
title: Mulliken charges:
elementType: Br S O O C C C C C C C C C C C C C C H H H H H H H H H H H H H
charge: 0.045526 0.938623 -0.555599 -0.540095 -0.837834 -0.767792 0.583637 0.524089 -0.379047 -0.278525 -0.340403 -0.348797 -0.212549 -0.219177 -0.217675 -0.216725 -0.225034 -0.225508 0.337533 0.267635 0.286184 0.238023 0.258795 0.240469 0.243337 0.234428 0.234235 0.231861 0.232301 0.234698 0.233384
chargesum: 0.00000
title: Mulliken charges with hydrogens summed into heavy atoms:
elementType: Br S O O C C C C C C C C C C C C C C
charge: 0.045526 0.938623 -0.555599 -0.540095 -0.500301 -0.213972 0.583637 0.524089 -0.141024 -0.019730 -0.099934 -0.105460 0.021879 0.015058 0.014185 0.015576 0.009664 0.007876
polarizability: 3.42087006e+02 1.18098175e+01 1.77658328e+02 -2.54991639e+00 1.51575903e+01 1.72282729e+02
1716.lowfreq: -5.1593 -0.0013 -0.0003 0.0017 5.2762 6.3693 17.2853 19.9876 29.1269
frequency: 16.5067 19.7173 29.0545 39.2369 45.6872 73.0708 81.4555 117.3550 144.1669 170.3664 179.5263 186.8679 214.5810 255.8734 314.8467 340.2080 364.3548 396.6943 400.4362 414.9041 454.8082 510.8045 540.0428 568.3010 577.9364 606.0875 615.4816 654.1540 688.8324 690.9616 770.2035 774.7511 806.0488 813.9210 825.9984 841.5567 844.6975 861.2461 925.3703 926.8210 938.7023 975.9401 977.5237 986.7649 988.9019 999.5603 999.9388 1026.6529 1027.4353 1059.6794 1079.9810 1089.9599 1115.5894 1167.6441 1175.4417 1176.3434 1185.8771 1193.4719 1195.9943 1236.4974 1250.0951 1330.3402 1331.1413 1387.6633 1389.8766 1425.5135 1438.4127 1443.3113 1478.2037 1484.3165 1583.3207 1587.5949 1604.8162 1609.8118 3067.5616 3117.2030 3130.5678 3132.2339 3136.5236 3140.0623 3146.1565 3152.2076 3157.2716 3162.8994 3164.4774 3170.7169 3175.3777
redmass: 5.5790 5.7572 5.2055 4.9152 4.6055 7.5702 8.6686 9.5259 7.6427 7.9294 7.0828 7.1835 7.7050 6.1162 6.7301 2.0960 6.0929 2.8566 2.7651 6.2150 12.4075 4.1178 3.8787 5.7207 4.9498 6.1811 6.3045 5.7757 1.7021 1.6979 1.9603 1.9284 10.7088 4.4829 4.9479 1.2637 1.2662 2.0178 1.4537 1.4493 3.3657 1.3943 1.3974 5.9195 5.7897 1.3538 1.3483 2.1887 2.1784 1.2355 1.4237 1.4581 1.1867 1.1763 1.0863 1.0537 1.1879 1.1110 1.1169 2.8190 3.1531 1.2723 1.2755 8.0298 8.8078 1.1743 2.2381 2.2295 2.2173 2.3282 5.7595 5.8900 5.9329 5.9619 1.0572 1.0890 1.0850 1.0853 1.0882 1.0889 1.0927 1.0928 1.0972 1.1115 1.0969 1.1018 1.1004
irintensity: 2.9131 0.8028 0.2992 0.8450 1.1994 2.3163 2.8497 1.5785 1.6348 1.4197 20.0961 7.8292 1.5098 0.8343 15.3846 0.5711 51.6312 0.4510 0.0813 6.8573 33.1602 28.6775 32.4598 1.1604 27.3414 12.2040 0.0014 44.2403 59.0530 51.3793 23.2803 11.5761 45.6495 17.4850 7.9883 1.0290 0.2392 14.6295 2.0490 1.5039 43.4720 0.5653 0.1321 2.6133 1.2343 0.0898 0.2321 5.5166 3.7776 20.3545 23.6030 15.4620 6.2390 23.1156 3.7072 0.0037 14.2717 1.5848 5.6393 25.5627 63.5261 3.4229 1.4837 0.6732 1.6902 3.9936 21.7700 13.8446 1.4209 4.6045 3.4478 0.5939 11.3047 8.9432 8.2131 1.8811 1.3465 0.5245 0.4177 2.7049 16.2648 19.9727 25.4005 1.2721 23.5040 26.8136 14.7615
temp: 298.150 k
press: 1.00000 atm
elementType: 35 16 8 8 6 6 6 6 6 6 6 6 6 6 6 6 6 6 1 1 1 1 1 1 1 1 1 1 1 1 1
symmnumber: 1
zpe: 603507.1 jmol-1
zpe.correction: 0.229864 hartree
zpe.thermalcorrener: 0.247887 hartree
zpe.thermalcorrenthalpy: 0.248831 hartree
zpe.thermalcorrgfe: 0.178989 hartree
zpe.sumelectzpe: -1101.809110 hartree
zpe.sumelectthermal: -1101.791087 hartree
zpe.sumelectthermalent: -1101.790143 hartree
zpe.sumelectthermalfe: -1101.859985 hartree
dipole: 0.0936 1.7888 -1.3722
dipole: 2.2565
quadrupole: -97.4890 -125.9711 -115.0551
quadrupole: 7.2262 -0.1570 2.0851
quadrupole: 15.3494 -13.1327 -2.2167 7.2262 -0.1570 2.0851
hfenergy: -1102.038974 hartree
pointgroup: C01 [X(C14H13Br1O2S1)]
dipole: 0.099301 0.5177546 -0.7142891 debye
polarizability: 342.8151406|-4.2748796|184.8057399|-1.1938811|11.7108719|164.4071822 unknown
InChI: InChI=1S/C14H13BrO2S/c15-14(13-9-5-2-6-10-13)18(16,17)11-12-7-3-1-4-8-12/h1-10,14H,11H2
charge 0 multiplicity 1
31 atoms
Br -1.475514 2.861751 -1.024628
S  0.068306 0.064287 -0.168201
O  0.147555 -1.437605 -0.81426
O  -0.040866 0.273922 1.446315
C  -1.64331 0.867064 -1.072533
C  1.703316 1.116493 -0.831676
C  -2.820807 0.284717 -0.396456
C  2.920917 0.420219 -0.359568
C  -3.482778 -0.808154 -1.025109
C  -3.253574 0.723887 0.885134
C  3.504192 -0.618463 -1.137516
C  3.504781 0.764658 0.891496
C  -4.57373 -1.435243 -0.389472
C  -4.346248 0.094324 1.512174
C  4.662437 -1.281335 -0.683495
C  4.662124 0.098709 1.343027
C  -5.009994 -0.983247 0.877775
C  5.245289 -0.922888 0.555526
H  -1.473427 0.539381 -2.107614
H  1.529887 1.095235 -1.9178
H  1.507247 2.1022 -0.388631
H  -3.136757 -1.164706 -2.001733
H  -2.730644 1.54807 1.37954
H  3.040766 -0.907542 -2.087317
H  3.04277 1.545552 1.506067
H  -5.07995 -2.274027 -0.878706
H  -4.675694 0.434214 2.499623
H  5.106882 -2.079916 -1.287006
H  5.106773 0.368911 2.306738
H  -5.858904 -1.470307 1.37022
H  6.144358 -1.440463 0.908089
