program: Gaussian 09
title: 000269283
version: EM64L-G09RevD.01
frameworkgroup: C1[X(C15H14O2S)]
method: RPBEPBE
basis: SDD
operation: Freq
keyword: #p
keyword: freq=noraman
keyword: PBEPBE/SDD
title: #p freq=noraman PBEPBE/SDD
converged: YES YES NO NO
title: Mulliken charges:
elementType: S O O C C C C C C C C C C C C C C C H H H H H H H H H H H H H H
charge: 0.197502 -0.428726 -0.217813 -0.699376 0.524773 -0.819920 0.486292 -0.430842 -0.341144 0.263256 -0.374410 -0.376034 -0.222371 -0.230288 -0.238174 -0.219009 -0.219872 -0.236182 0.300850 0.263666 0.298111 0.227344 0.271553 0.235889 0.236016 0.227253 0.228146 0.229833 0.227478 0.227880 0.230232 0.378087
chargesum: 0.00000
title: Mulliken charges with hydrogens summed into heavy atoms:
elementType: S O O C C C C C C C C C C C C C C C
charge: 0.197502 -0.050639 -0.217813 -0.398526 0.524773 -0.258143 0.486292 -0.203498 -0.069591 0.263256 -0.138522 -0.140017 0.004882 -0.002143 -0.008341 0.008469 0.008008 -0.005950
polarizability: 2.69288004e+02 -1.04190521e+01 1.65806899e+02 -9.85202970e-01 1.59142173e+01 1.39139425e+02
1716.lowfreq: -12.3204 -4.6877 -0.0017 0.0005 0.0008 6.8379 10.4232 24.0483 26.6896
frequency: 6.1283 23.7973 26.3631 43.6679 56.6906 67.0247 97.6666 119.9635 168.9072 172.0385 222.3957 271.8293 317.8894 329.1167 331.9922 401.8023 402.4539 470.5695 490.5870 539.7000 551.7120 575.1538 614.5110 616.1652 632.6938 641.0696 669.0769 699.9012 701.0820 719.7760 773.8890 783.4647 804.7917 828.7943 849.2859 851.5237 887.1853 899.6923 925.4591 929.6719 975.5695 976.5834 989.8737 990.1924 996.5277 997.4872 1025.6308 1026.9721 1034.9922 1072.0087 1085.2662 1125.3786 1167.6322 1172.9307 1173.6973 1187.5113 1193.5524 1196.6730 1220.4011 1243.7925 1246.2277 1318.3330 1325.3171 1351.4894 1385.0502 1386.7717 1440.3044 1443.5766 1465.8745 1482.7101 1484.7324 1592.4507 1593.1420 1612.5923 1613.3210 1664.7988 3024.8802 3066.1313 3103.5154 3118.3166 3121.7936 3124.4895 3130.5443 3136.9916 3144.4991 3148.6698 3160.9722 3165.2357 3176.8146 3512.2861
redmass: 5.2118 4.0635 4.0297 6.6914 6.5475 5.6881 6.2698 6.9233 7.8515 5.8987 4.8335 5.3581 6.9752 2.4902 6.3435 2.7958 2.7988 3.7527 3.9735 3.2136 5.5187 2.9337 5.9048 6.3228 2.3704 3.9810 3.8020 1.7674 1.6902 3.4817 2.0268 2.6506 3.8056 4.6265 1.2540 1.2499 3.6919 1.5904 1.4554 1.6156 1.4021 1.3926 5.8617 5.9192 1.3374 1.3277 2.2170 2.5280 2.1250 1.4910 1.6130 1.0911 1.1278 1.0522 1.0646 1.1123 1.1460 1.5598 2.3545 1.3890 1.8731 1.6191 1.2782 1.6937 8.6873 6.2557 2.1959 2.1735 1.1142 2.3412 2.3182 6.0105 6.0832 6.1180 6.0830 8.5916 1.0576 1.0859 1.1082 1.0872 1.0856 1.0877 1.0875 1.0920 1.0932 1.0964 1.0983 1.1017 1.0972 1.0640
irintensity: 0.1117 0.0790 0.0648 0.1159 1.1732 1.2222 0.2719 1.4983 3.0056 0.6182 0.9040 0.2544 0.7599 0.9089 3.8307 0.0109 0.0448 6.3721 4.6313 22.7272 8.9485 31.5128 4.4627 0.4326 126.1185 45.2666 51.1811 52.6646 71.3190 3.0083 22.2689 29.0979 15.1892 5.9346 0.2294 0.0494 24.5796 2.7071 1.4299 1.7183 0.2009 0.0555 0.5209 2.8743 0.0182 0.3513 11.7091 52.4486 184.6108 10.0295 11.1158 2.4460 7.1190 0.0266 1.4328 1.3756 3.8968 4.3698 0.7706 9.1263 6.2851 12.7149 0.8877 19.0005 0.2760 2.2628 9.8985 11.6462 8.1649 14.7446 18.3157 1.0376 0.8294 1.6073 2.1883 251.0216 17.9026 4.5301 4.1921 7.1280 6.2908 1.1987 1.8261 14.1500 30.4245 39.3501 32.8241 24.8271 5.2023 26.6377
temp: 298.150 k
press: 1.00000 atm
elementType: 16 8 8 6 6 6 6 6 6 6 6 6 6 6 6 6 6 6 1 1 1 1 1 1 1 1 1 1 1 1 1 1
symmnumber: 1
zpe: 651426.4 jmol-1
zpe.correction: 0.248115 hartree
zpe.thermalcorrener: 0.264920 hartree
zpe.thermalcorrenthalpy: 0.265864 hartree
zpe.thermalcorrgfe: 0.198493 hartree
zpe.sumelectzpe: -1127.227913 hartree
zpe.sumelectthermal: -1127.211108 hartree
zpe.sumelectthermalent: -1127.210164 hartree
zpe.sumelectthermalfe: -1127.277535 hartree
dipole: -1.2378 -0.2396 -2.0188
dipole: 2.3801
quadrupole: -102.2678 -104.2001 -110.5034
quadrupole: -7.2258 -3.6136 0.7688
quadrupole: 3.3893 1.4570 -4.8463 -7.2258 -3.6136 0.7688
hfenergy: -1127.4760285 hartree
pointgroup: C01 [X(C15H14O2S1)]
dipole: 0.4763533 -0.0752614 0.8026755 debye
polarizability: 268.9832305|12.0590846|165.6106828|0.9719754|-16.1595348|139.640415 unknown
InChI: InChI=1S/C15H14O2S/c16-15(17)14(13-9-5-2-6-10-13)18-11-12-7-3-1-4-8-12/h1-10,14,16H,11H2
charge 0 multiplicity 1
32 atoms
S  0.202425 -0.092712 -0.368501
O  -0.568955 2.875449 1.016227
O  -1.942781 2.70619 -0.84795
C  -1.364813 0.676176 0.490947
C  -2.594174 -0.117917 0.110581
C  1.534701 0.356661 0.944403
C  2.895289 -0.022387 0.412623
C  -3.153103 -1.007118 1.064761
C  -3.182633 -0.030254 -1.178474
C  -1.369502 2.146422 0.109476
C  3.656636 0.901951 -0.349496
C  3.431676 -1.313596 0.656324
C  -4.281109 -1.793056 0.743576
C  -4.309104 -0.818879 -1.498283
C  -4.862543 -1.70166 -0.541988
C  4.928772 0.546923 -0.849125
C  4.703725 -1.67137 0.156993
C  5.456644 -0.741297 -0.596831
H  -1.160872 0.594482 1.570579
H  1.279328 -0.202519 1.860074
H  1.43737 1.438088 1.128792
H  -2.702295 -1.084067 2.062064
H  -2.768807 0.662458 -1.916402
H  3.246374 1.898427 -0.552342
H  2.848216 -2.038086 1.23742
H  -4.703871 -2.472297 1.492149
H  -4.756981 -0.74278 -2.495337
H  -5.737287 -2.311161 -0.795082
H  5.507246 1.271224 -1.433442
H  5.106498 -2.6709 0.355231
H  6.443842 -1.017073 -0.984134
H  -0.553217 3.829278 0.730267
