program: Gaussian 09
title: 000269268
version: EM64L-G09RevD.01
frameworkgroup: C1[X(CH6N2O2S)]
method: RPBEPBE
basis: SDD
operation: Freq
keyword: #p
keyword: freq=noraman
keyword: PBEPBE/SDD
title: #p freq=noraman PBEPBE/SDD
converged: YES YES NO NO
title: Mulliken charges:
elementType: S O O N N C H H H H H H
charge: 0.872968 -0.604808 -0.571229 -0.291283 -0.452315 -0.761827 0.262224 0.267559 0.291636 0.286763 0.363304 0.337009
chargesum: 0.00000
title: Mulliken charges with hydrogens summed into heavy atoms:
elementType: S O O N N C
charge: 0.872968 -0.604808 -0.571229 -0.004520 0.247998 0.059592
polarizability: 1.01516804e+02 1.59751120e+00 5.66104695e+01 7.77291242e-02 1.96342579e+00 5.41978236e+01
1716.lowfreq: -11.7256 -0.0015 -0.0005 0.0016 8.2355 13.8960 54.5532 76.8500 92.2330
frequency: 54.5050 76.8367 92.2254 142.6683 215.4115 247.8822 293.2981 373.5107 380.7866 404.9931 575.8198 679.2164 763.7737 856.6390 877.8481 962.8877 993.9283 1129.9783 1228.2372 1301.5730 1416.0737 1420.5734 1435.3967 1688.8926 3031.7327 3179.2266 3184.1643 3288.3354 3414.0833 3599.4060
redmass: 2.0422 4.2112 4.2898 1.1233 4.2992 4.1995 6.2521 8.9533 5.1443 1.4420 6.7968 1.3769 10.9812 4.3665 1.1270 1.2773 1.5254 1.1577 4.1140 1.1372 1.0570 1.0571 1.3321 1.0830 1.0248 1.1071 1.1071 1.0761 1.0500 1.0963
irintensity: 33.7932 3.3161 11.3398 2.0726 28.6753 23.4730 15.7896 13.5672 3.0977 3.2280 26.1965 565.7451 40.5307 36.5140 60.7760 26.2415 28.7854 26.1167 158.9825 2.6569 14.5518 16.0157 17.1420 27.4788 2.2144 1.4512 1.8831 17.1050 52.9762 43.4138
temp: 298.150 k
press: 1.00000 atm
elementType: 16 8 8 7 7 6 1 1 1 1 1 1
symmnumber: 1
zpe: 223162.8 jmol-1
zpe.correction: 0.084998 hartree
zpe.thermalcorrener: 0.093924 hartree
zpe.thermalcorrenthalpy: 0.094868 hartree
zpe.thermalcorrgfe: 0.050871 hartree
zpe.sumelectzpe: -699.013671 hartree
zpe.sumelectthermal: -699.004745 hartree
zpe.sumelectthermalent: -699.003801 hartree
zpe.sumelectthermalfe: -699.047798 hartree
dipole: 3.1486 2.4593 -1.5156
dipole: 4.2730
quadrupole: -37.3877 -44.4146 -47.6368
quadrupole: -9.9500 2.2735 1.7322
quadrupole: 5.7586 -1.2682 -4.4904 -9.9500 2.2735 1.7322
hfenergy: -699.0986688 hartree
pointgroup: C01 [X(C1H6N2O2S1)]
dipole: -1.1295074 1.2422652 0.0850709 debye
dipolederiv: 0.8515504 0.0623001 0.0551536 0.0476264 1.0573139 -0.1041034 -0.2758605 -0.0002832 0.9735494 -0.4333176 -0.0668177 -0.0047936 0.0129304 -0.5276743 -0.0244771 0.1272129 -0.1069957 -0.676787 -0.7627228 0.1219599 -0.0964585 0.1827782 -0.6220422 0.0967051 -0.0049073 0.085257 -0.5589532 1.1878009 -0.1386425 -0.0798019 0.3006973 -0.2737123 -0.1762976 0.7985948 -0.3162951 -0.3489579 -1.6043757 0.3264838 0.096674 -0.2585247 0.0092794 0.0387498 -0.6041862 0.1542168 0.0739306 -0.1830453 -0.0766791 0.0118959 -0.0018222 -0.1648541 0.0458561 0.1093742 0.0423581 -0.0640458 0.0012006 0.0238362 -0.0321803 0.0000674 -0.0040495 0.0624885 -0.0166452 0.0700649 0.0725428 0.0543721 -0.0658976 -0.0357371 -0.0584695 0.0483157 -0.0264508 -0.0300102 -0.0301402 -0.0138534 -0.0057354 0.0072171 0.0595461 -0.0305542 0.0447662 -0.0302591 0.0754282 -0.0221728 0.0652288 0.0832419 -0.0280591 0.0385768 0.0640438 0.1032881 0.1432155 -0.0388685 0.1128377 0.1191785 0.3420999 -0.071674 0.0521292 -0.2090908 0.2251995 -0.0246379 0.0746291 0.0095141 0.1745049 0.4689311 -0.094027 -0.0650041 -0.0496823 0.1041695 -0.0007891 -0.2147612 0.0016384 0.1836623 unknown
polarizability: 100.8689548|-5.6562374|55.1450634|0.5842452|-2.1802209|56.3110793 unknown
InChI: InChI=1S/CH3O2S.H3N2/c1-4(2)3;1-2/h1H3;1H,2H2
charge 0 multiplicity 1
12 atoms
S  0.579211 -0.114296 0.267238
O  -0.094995 -0.611021 -1.166906
O  1.442114 -1.191222 1.16688
N  -1.402889 0.876779 0.991764
N  -2.278537 0.344326 0.106855
C  1.785156 1.29413 -0.200213
H  1.195954 2.049919 -0.736357
H  2.20679 1.677419 0.738882
H  2.549426 0.82996 -0.839079
H  -1.471482 0.350888 1.893964
H  -2.247544 0.761662 -0.82566
H  -2.593102 -0.635045 0.137633
