program: Gaussian 09
title: 000269265
version: EM64L-G09RevD.01
frameworkgroup: C1[X(C16H12O4)]
method: RPBEPBE
basis: SDD
operation: Freq
keyword: #pfreq=noraman
keyword: PBEPBE/SDD
title: #p freq=noraman PBEPBE/SDD
converged: YES YES NO NO
title: Mulliken charges:
elementType: O O O O C C C C C C C C C C C C C C C C H H H H H H H H H H H H
charge: -0.270168 -0.270187 -0.246608 -0.246606 -0.306671 0.312443 0.399042 0.399046 0.193446 0.193408 -0.405514 -0.405515 -0.433263 -0.433264 -0.366662 -0.366661 0.134413 0.134420 -0.503750 -0.503750 0.257747 0.257748 0.254488 0.254489 0.262903 0.262914 0.238403 0.231344 0.251311 0.231343 0.238408 0.251303
chargesum: 0.00000
title: Mulliken charges with hydrogens summed into heavy atoms:
elementType: O O O O C C C C C C C C C C C C C C C C
charge: -0.270168 -0.270187 -0.246608 -0.246606 -0.306671 0.312443 0.399042 0.399046 0.193446 0.193408 -0.147767 -0.147767 -0.178776 -0.178775 -0.103759 -0.103746 0.134413 0.134420 0.217309 0.217304
polarizability: 2.70169908e+02 -4.46852281e-04 2.31343279e+02 9.59161340e-04 9.86804169e+00 8.89783797e+01
1716.lowfreq: -0.0008 -0.0007 -0.0004 2.0082 8.7931 10.6543 33.8611 40.4320 65.5623
frequency: 33.7875 40.3972 65.5619 83.7304 112.6227 114.3760 123.5776 153.0034 167.0552 184.8065 195.3186 221.0249 237.3489 266.2184 287.3693 303.1868 330.7238 338.9311 428.6322 431.2896 454.4966 505.6399 528.3745 562.4227 576.8765 600.8106 650.4475 666.4803 697.1301 701.7847 718.4582 740.4166 760.5595 761.6954 771.1215 822.4494 824.5801 869.6214 869.9750 881.0311 932.7608 937.7781 963.8963 974.7003 975.8198 1040.2805 1068.8104 1088.0195 1113.1110 1114.8707 1118.6551 1122.2924 1149.7450 1150.4908 1176.6256 1204.6905 1212.6892 1254.4464 1271.0046 1317.4824 1335.0196 1384.5419 1392.4779 1421.2802 1423.4783 1451.9274 1452.6028 1457.1473 1464.0159 1465.0301 1465.8996 1488.2286 1491.2782 1601.5910 1604.4892 1607.7613 1618.7642 1626.1059 3003.3205 3003.4722 3106.0268 3106.1585 3142.4886 3142.5279 3147.9097 3147.9441 3169.7848 3169.9240 3180.1143 3206.4659
redmass: 7.0343 4.2129 4.7125 4.1640 1.9004 1.0880 1.5843 3.7133 4.0303 8.3975 4.7813 5.9236 7.9453 4.7874 5.4159 4.4073 4.7205 7.2710 5.0064 5.3388 3.3806 5.6244 4.4766 6.5267 5.9412 4.6573 6.5541 4.4431 6.1046 5.3098 3.9174 6.2581 2.8405 6.1483 2.6521 5.2250 3.7476 1.9942 1.4507 2.9723 1.4002 6.9825 5.0649 1.4799 1.4493 2.5712 4.5774 1.3963 1.4234 1.2834 1.6140 2.4045 1.4517 1.4798 2.7003 1.6774 6.6787 2.3351 1.8011 2.5828 2.4023 4.2377 3.4785 1.1926 1.2554 1.0519 1.0496 4.1190 1.0850 1.0526 5.0335 4.8937 4.8237 9.5744 7.4577 8.8822 8.6429 9.5082 1.0295 1.0295 1.1044 1.1044 1.0904 1.0903 1.1048 1.1048 1.0942 1.0941 1.0887 1.1053
irintensity: 6.6641 0.1906 1.2765 1.8858 1.1377 0.0066 0.4534 0.0283 12.1323 0.7837 0.0287 0.0420 5.4242 4.9011 13.2936 18.0132 7.2389 7.4529 0.1957 3.0622 0.6958 2.5088 8.9650 0.3362 0.6162 3.0132 3.2214 0.2886 9.5562 0.5306 40.9743 7.8808 13.6212 0.4251 0.6435 1.1376 4.2131 104.4731 0.6085 37.3539 0.0158 3.4423 16.9492 1.8090 1.5075 95.6896 140.0317 165.8629 12.1125 2.7540 52.2453 2.3393 26.0611 70.1393 112.5927 13.4126 147.6981 78.5848 183.4241 0.1158 0.0136 17.4696 5.8210 3.4267 70.8753 23.5612 4.2740 3.3067 1.8326 20.4807 9.5374 6.6013 73.9985 145.0415 1.0906 0.9698 88.8730 100.4172 19.2782 64.1380 2.0793 43.2531 8.0400 10.6320 34.7462 1.6309 12.1562 0.1976 0.4799 18.1514
temp: 298.150 k
press: 1.00000 atm
elementType: 8 8 8 8 6 6 6 6 6 6 6 6 6 6 6 6 6 6 6 6 1 1 1 1 1 1 1 1 1 1 1 1
symmnumber: 1
zpe: 625343.6 jmol-1
zpe.correction: 0.238181 hartree
zpe.thermalcorrener: 0.255593 hartree
zpe.thermalcorrenthalpy: 0.256537 hartree
zpe.thermalcorrgfe: 0.192314 hartree
zpe.sumelectzpe: -916.400633 hartree
zpe.sumelectthermal: -916.383220 hartree
zpe.sumelectthermalent: -916.382276 hartree
zpe.sumelectthermalfe: -916.446499 hartree
dipole: -0.7997 0.0001 -0.0001
dipole: 0.7997
quadrupole: -91.2287 -91.6212 -124.2193
quadrupole: 0.0003 -0.0003 -1.4618
quadrupole: 11.1277 10.7352 -21.8629 0.0003 -0.0003 -1.4618
hfenergy: -916.6388134 hartree
pointgroup: C01 [X(C16H12O4)]
dipole: -0.3146392 -0.000003 -0.00008 debye
polarizability: 270.1699027|-0.0021784|223.6050469|0.0294381|33.7513073|96.7166175 unknown
InChI: InChI=1S/C16H12O4/c1-19-15(17)11-7-5-9-3-4-10-6-8-12(16(18)20-2)14(11)13(9)10/h3-8H,1-2H3
charge 0 multiplicity 1
32 atoms
O  2.229621 -2.527105 -0.763313
O  2.228902 2.527346 0.764662
O  2.366378 -1.008003 0.997015
O  2.366617 1.008221 -0.995563
C  -1.779525 -0.000228 -0.000057
C  -0.366563 -0.00015 0.00023
C  -2.610616 -1.140573 -0.255628
C  -2.610847 1.140022 0.255192
C  0.252309 -1.299555 -0.1994
C  0.25208 1.299324 0.200125
C  -4.013139 -0.67684 -0.154892
C  -4.013277 0.676131 0.153896
C  -1.989045 -2.360136 -0.537948
C  -1.989528 2.359653 0.537773
C  -0.557924 -2.417413 -0.491827
C  -0.558395 2.417089 0.492229
C  1.700848 -1.545075 0.078492
C  1.700709 1.545008 -0.077147
C  3.658527 -2.844709 -0.535917
C  3.657772 2.845387 0.537647
H  -4.89244 -1.306312 -0.304432
H  -4.892708 1.305503 0.303086
H  -2.5591 -3.268129 -0.76195
H  -2.559776 3.267579 0.761554
H  -0.058746 -3.376849 -0.656999
H  -0.059391 3.37658 0.657613
H  3.810625 -3.230346 0.486683
H  3.898904 -3.607431 -1.289796
H  4.269454 -1.937781 -0.677733
H  3.897664 3.608319 1.291468
H  3.810061 3.230897 -0.484972
H  4.268952 1.938683 0.679809
