program: Gaussian 09
title: 000269390
version: EM64L-G09RevD.01
frameworkgroup: C1[X(C22H24N2O8)]
method: RPBEPBE
basis: SDD
operation: Freq
keyword: #p
keyword: freq=noraman
keyword: PBEPBE/SDD
title: #p freq=noraman PBEPBE/SDD
converged: YES YES NO NO
title: Mulliken charges:
elementType: O O O O O O O O N N C C C C C C C C C C C C C C C C C C C C C C H H H H H H H H H H H H H H H H H H H H H H H H
charge: -0.267930 -0.291305 -0.251540 -0.250457 -0.201729 -0.200228 -0.203365 -0.224087 0.019981 0.018110 -0.384858 -0.391685 -0.354045 -0.363936 -0.408092 -0.387963 -0.315957 -0.286596 0.201048 0.204340 0.252552 0.263312 -0.450803 -0.458724 -0.349554 -0.357088 0.394035 0.443030 -0.183397 -0.181922 -0.357802 -0.352556 0.193406 0.197218 0.189962 0.197511 0.225558 0.188231 0.189985 0.230542 0.237428 0.206133 0.210357 0.197977 0.238123 0.227997 0.243636 0.224879 0.341119 0.311465 0.281334 0.278337 0.245712 0.244181 0.289926 0.288195
chargesum: 0.00000
title: Mulliken charges with hydrogens summed into heavy atoms:
elementType: O O O O O O O O N N C C C C C C C C C C C C C C C C C C C C C C
charge: -0.267930 -0.291305 -0.251540 -0.250457 -0.201729 -0.200228 -0.203365 -0.224087 0.019981 0.018110 0.005766 -0.004213 0.059744 0.056591 0.035469 0.020371 0.150163 0.181919 0.201048 0.204340 0.252552 0.263312 -0.109683 -0.147259 -0.068220 -0.078751 0.394035 0.443030 0.062315 0.062259 -0.067876 -0.064362
polarizability: 3.13256389e+02 -2.35684926e+01 3.34009995e+02 -1.53370803e+01 9.69397234e+00 2.19848527e+02
1716.lowfreq: -4.7497 0.0004 0.0008 0.0008 2.2961 5.5043 10.2767 14.1767 23.4534
frequency: 9.6852 14.1429 23.3998 24.2413 31.0886 39.7688 48.1824 51.6956 55.5887 61.5228 68.9601 79.9994 89.0657 97.6064 100.8607 111.9994 133.3953 158.0827 162.5957 177.1546 187.7497 192.4234 205.8316 213.9345 235.2701 239.2709 264.5510 286.2869 305.5522 325.2057 328.2402 348.5289 373.3107 386.6991 421.0972 425.6838 439.5514 449.1876 461.4675 461.8908 483.1717 491.8799 512.2736 534.3185 537.7001 643.2621 644.2881 654.8912 655.6177 681.5336 687.8235 696.2024 697.5947 718.4829 734.9001 740.3487 741.3317 755.1150 765.3175 785.4816 799.4087 832.3682 833.6090 841.1168 854.3550 870.2979 883.8204 890.6558 918.9990 942.5621 960.6417 969.9465 971.4855 980.4973 985.3294 988.4655 990.6835 1013.9830 1014.7880 1014.8126 1035.4643 1057.1610 1059.0894 1071.3210 1078.2674 1084.2628 1088.8642 1101.0748 1105.7920 1108.0010 1108.6653 1137.5700 1157.1072 1172.2323 1172.6973 1189.4825 1212.2743 1213.4419 1214.7384 1239.1484 1246.4722 1251.3851 1258.7548 1272.9518 1283.7278 1284.3175 1288.2533 1290.2666 1294.3329 1306.1331 1341.9865 1347.1513 1361.0147 1363.2840 1366.3822 1366.8990 1369.8615 1371.7051 1400.5620 1402.3605 1430.9171 1432.7466 1450.8137 1452.6985 1455.3495 1463.9016 1465.0158 1471.1976 1473.2407 1474.5570 1479.2159 1484.2414 1581.2228 1584.1319 1612.4587 1616.6504 1619.2286 1625.0744 2952.0403 2958.7393 2966.4232 2968.9831 2974.7945 2979.1135 3001.6401 3002.3172 3010.5790 3024.9041 3030.3759 3033.0389 3053.2203 3059.8844 3076.1905 3108.6631 3152.7403 3152.8968 3169.0361 3170.1858 3170.6457 3187.3170 3189.8147 3202.9333
redmass: 6.2079 7.4644 7.5656 7.6725 4.5821 9.0996 7.9923 8.6589 8.1595 9.6795 10.9776 2.8240 4.6864 4.4333 2.2263 2.9656 4.3914 3.9875 4.6329 4.2619 3.3823 4.9321 3.6039 3.3749 5.0969 3.7299 4.3301 3.7126 3.0788 7.7273 8.1582 4.3122 6.1088 3.9788 3.1537 3.1730 5.0764 4.9292 5.2712 4.5634 3.2077 4.2347 3.2793 5.7190 5.5537 7.0046 7.1872 5.7148 5.6109 7.6883 7.9787 2.4346 2.4869 1.2061 1.4469 5.7570 5.6622 4.6587 2.4862 2.7006 2.3191 1.4906 1.5053 2.8143 2.9935 3.1562 2.4382 3.0583 2.0519 2.4798 1.5134 1.4165 1.3893 1.4518 1.9958 5.6147 6.1897 1.3793 1.4094 2.1964 1.6910 2.4697 2.5083 2.2623 2.5094 1.8576 1.9461 2.1035 2.2367 2.5654 2.3940 2.0633 1.4836 1.1621 1.1490 1.3896 2.5611 1.6595 5.9216 1.2733 3.7010 3.9066 1.3537 1.2419 1.2016 1.4401 1.3420 1.1594 1.1753 1.0902 1.4292 1.3887 1.4815 1.4732 1.6291 1.4924 7.8413 6.9480 8.1255 7.8397 3.1607 3.1331 1.1138 1.0817 1.0779 1.0738 1.0801 1.6124 2.6839 1.5161 1.1001 1.0966 7.1840 7.3059 7.0120 7.2188 9.5769 10.8609 1.0589 1.0629 1.0634 1.0651 1.0633 1.0611 1.0622 1.0954 1.0958 1.0804 1.0952 1.0761 1.1014 1.0997 1.1070 1.1081 1.0880 1.0881 1.0939 1.0946 1.0943 1.0973 1.0968 1.0924
irintensity: 0.1146 0.4106 0.5927 0.4388 0.6041 0.2055 1.6049 0.9480 3.2935 3.9851 0.2745 0.3305 0.8514 0.7174 0.6921 0.6231 1.7061 1.0008 4.5346 0.8100 1.4269 2.6296 5.6604 2.0022 0.5223 5.4375 1.4235 1.4604 7.5176 8.7534 1.6227 2.1287 0.2313 3.0122 0.0441 0.4185 4.0516 4.4143 0.5431 1.6639 0.6688 5.2163 1.6387 1.4105 0.4087 2.0431 2.1443 3.3951 2.8428 25.4175 24.2274 59.4555 57.2683 12.1889 5.2686 8.8470 7.3222 0.9128 0.8067 9.6186 6.0841 26.4615 28.4596 7.9847 4.4650 12.9869 10.9178 5.2644 16.2611 1.1408 16.4519 0.9756 1.5368 10.7101 5.6236 1.4905 2.8346 1.5635 1.4736 26.7640 1.5412 97.1691 173.0459 33.6320 54.2595 31.9677 32.0642 2.0128 44.9241 24.6810 109.7116 7.4809 18.8937 30.0768 16.3744 11.9908 192.6506 57.4806 212.2277 27.8971 294.3512 263.8984 16.1778 4.7940 6.1337 31.9032 23.9903 3.4505 5.0523 2.1963 2.0367 0.5372 4.9242 1.0163 5.7368 11.6534 127.1364 145.7974 4.8788 6.1573 34.5557 24.2046 23.1362 5.0589 4.8219 2.7218 0.6608 14.1344 3.7871 3.6343 18.4241 13.8348 8.5086 7.9312 7.7731 11.3652 206.4001 210.4643 21.8362 16.4141 36.0225 16.4659 45.9915 53.5707 18.3439 24.5861 33.8226 22.1103 6.5145 5.9707 116.0931 76.4101 31.0904 13.0694 3.7846 3.4628 5.1647 7.7371 33.2202 5.1847 2.4906 7.4455
temp: 298.150 k
press: 1.00000 atm
elementType: 8 8 8 8 8 8 8 8 7 7 6 6 6 6 6 6 6 6 6 6 6 6 6 6 6 6 6 6 6 6 6 6 1 1 1 1 1 1 1 1 1 1 1 1 1 1 1 1 1 1 1 1 1 1 1 1
symmnumber: 1
zpe: 1134381.2 jmol-1
zpe.correction: 0.432063 hartree
zpe.thermalcorrener: 0.463068 hartree
zpe.thermalcorrenthalpy: 0.464012 hartree
zpe.thermalcorrgfe: 0.363871 hartree
zpe.sumelectzpe: -1561.537207 hartree
zpe.sumelectthermal: -1561.506202 hartree
zpe.sumelectthermalent: -1561.505258 hartree
zpe.sumelectthermalfe: -1561.605399 hartree
dipole: 0.4258 2.7728 -1.4741
dipole: 3.1690
quadrupole: -182.1545 -177.4518 -187.1165
quadrupole: 7.1795 14.5034 0.6218
quadrupole: 0.0864 4.7891 -4.8755 7.1795 14.5034 0.6218
hfenergy: -1561.9692704 hartree
pointgroup: C01 [X(C22H24N2O8)]
dipole: 0.2010843 1.1130362 0.5245817 debye
polarizability: 336.1322016|23.6238223|313.2137477|-5.3805472|-7.4115764|217.7689617 unknown
InChI: InChI=1S/C22H24N2O8/c25-21(17-9-7-11-19(15-17)23(27)28)31-13-5-3-1-2-4-6-14-32-22(26)18-10-8-12-20(16-18)24(29)30/h7-12,15-16H,1-6,13-14H2
charge 0 multiplicity 1
56 atoms
O  3.24684 0.264302 -0.673786
O  -3.009022 2.291259 0.278685
O  5.296219 0.160848 0.443712
O  -5.135779 1.573462 0.922353
O  -0.099648 -4.416702 1.973196
O  -0.591762 -2.543457 -2.927289
O  -0.385754 -2.818893 0.37781
O  0.11121 -0.591337 -1.987507
N  0.321458 -3.414375 1.277996
N  -0.794191 -1.485452 -2.220226
C  1.802338 4.452306 0.017515
C  0.345948 4.974981 -0.051154
C  2.019858 3.108722 -0.719043
C  -0.687698 4.048484 0.627787
C  3.513939 2.743935 -0.857109
C  -2.139852 4.549798 0.458997
C  3.758867 1.384849 -1.526693
C  -3.190614 3.583153 1.008936
C  4.123943 -0.256407 0.264793
C  -4.0475 1.368127 0.331207
C  3.506345 -1.38681 1.031583
C  -3.693908 0.112923 -0.403461
C  2.193963 -1.843956 0.76378
C  -2.413341 -0.072358 -0.972763
C  4.285984 -2.001251 2.045564
C  -4.671053 -0.91066 -0.505118
C  1.697783 -2.915849 1.533555
C  -2.141429 -1.2826 -1.635552
C  3.762374 -3.074068 2.797907
C  -4.372616 -2.114089 -1.17968
C  2.45704 -3.543451 2.547126
C  -3.099788 -2.312504 -1.754146
H  2.475034 5.216493 -0.424499
H  2.110091 4.343993 1.078399
H  0.064226 5.107507 -1.11723
H  0.295802 5.981734 0.41287
H  1.496933 2.289256 -0.190916
H  1.565165 3.168324 -1.730359
H  -0.447876 3.951653 1.707382
H  -0.617732 3.033587 0.196286
H  4.012247 2.75433 0.13155
H  4.026797 3.512385 -1.472465
H  -2.346776 4.727628 -0.6146
H  -2.271014 5.522822 0.975289
H  4.834573 1.213891 -1.707892
H  3.182417 1.274385 -2.459557
H  -4.225225 3.934984 0.84855
H  -3.048566 3.377191 2.086623
H  1.589122 -1.383783 -0.023296
H  -1.646151 0.699872 -0.896299
H  5.297872 -1.621979 2.221751
H  -5.65115 -0.7432 -0.046512
H  4.369131 -3.544577 3.57751
H  -5.128436 -2.902122 -1.250622
H  2.020099 -4.372759 3.109486
H  -2.833938 -3.238443 -2.270229
