program: Gaussian 09
title: 000269267
version: EM64L-G09RevD.01
frameworkgroup: C1[X(C16H14O6S)]
method: RPBEPBE
basis: SDD
operation: Freq
keyword: #p
keyword: freq=noraman
keyword: PBEPBE/SDD
title: #p freq=noraman PBEPBE/SDD
converged: YES YES NO NO
title: Mulliken charges:
elementType: S O O O O O O C C C C C C C C C C C C C C C C H H H H H H H H H H H H H H
charge: 0.859771 -0.518383 -0.518393 -0.414363 -0.414395 -0.262460 -0.262474 -0.545913 -0.546052 0.471346 0.471271 0.207408 0.207415 -0.355051 -0.354897 -0.363583 -0.363597 -0.225739 -0.225786 -0.213176 -0.213202 -0.224246 -0.224244 0.366535 0.366613 0.257982 0.257985 0.295071 0.295112 0.233875 0.233871 0.232271 0.232263 0.235245 0.235238 0.393340 0.393341
chargesum: 0.00000
title: Mulliken charges with hydrogens summed into heavy atoms:
elementType: S O O O O O O C C C C C C C C C C C C C C C C
charge: 0.859771 -0.518383 -0.518393 -0.021023 -0.021054 -0.262460 -0.262474 -0.179378 -0.179438 0.471346 0.471271 0.207408 0.207415 -0.097068 -0.096912 -0.068512 -0.068485 0.008136 0.008085 0.019095 0.019062 0.010999 0.010994
polarizability: 5.26505778e+02 -6.71929576e+00 2.31212521e+02 -4.68936878e-03 7.13962780e-03 1.54249370e+02
1716.lowfreq: -5.3768 -0.0016 -0.0008 0.0009 3.1088 8.8014 20.4946 24.3950 38.7395
frequency: 20.4936 24.2722 38.7390 48.2179 53.7232 54.7871 64.1005 77.2643 78.8381 102.5286 116.3402 124.9837 137.0781 153.3006 171.6405 180.4172 201.8147 283.7559 290.8706 308.8392 313.4349 351.2569 353.5375 369.6232 378.4945 398.4481 399.0310 505.2037 506.6082 566.9238 569.2655 591.9129 592.0342 611.3587 611.5767 636.9572 637.2136 687.7083 687.8365 700.2893 700.4043 780.8182 780.9444 806.4800 812.3296 819.4081 852.5498 852.6115 907.4771 910.9019 915.9121 943.3974 944.1349 986.5217 986.6162 989.6209 989.7360 1006.0224 1006.1499 1026.9739 1027.2143 1054.6170 1062.4628 1082.2029 1084.7170 1116.0216 1118.6863 1176.4755 1176.5923 1199.4050 1201.1215 1227.5400 1232.1674 1328.8892 1329.0772 1339.2343 1347.4946 1377.9299 1380.4853 1402.8092 1406.7813 1450.1638 1452.3241 1487.1279 1487.5668 1569.1677 1569.2835 1583.8961 1591.6134 1605.5892 1606.2191 3096.7903 3097.7137 3130.7921 3130.8162 3137.6436 3137.6661 3151.6571 3151.6639 3167.3138 3167.5073 3194.3268 3194.3837 3514.0025 3514.1557
redmass: 6.4846 7.4251 4.8295 4.2380 8.6119 4.9674 8.1030 8.1464 9.1881 11.4820 14.0445 5.9508 6.7026 12.3104 6.5306 5.6476 10.7886 5.0413 5.0342 5.5535 5.0212 10.2325 10.1008 18.3712 11.9530 2.8207 2.8792 2.9755 2.9335 4.3429 4.4011 1.3566 1.3338 6.4667 6.4791 5.2178 5.1749 1.6807 1.6861 5.8151 5.5776 1.8546 1.8743 6.3886 6.3655 15.3054 1.2507 1.2505 4.7967 4.9566 12.4932 1.4018 1.4035 5.2977 5.2275 1.4342 1.4399 1.3396 1.3389 2.2002 2.1892 1.3545 1.3627 1.6272 1.5499 1.6652 1.6279 1.0652 1.0635 1.1244 1.1260 1.6719 1.7146 1.5778 1.5614 2.1251 2.2224 2.6141 2.8722 3.5928 3.0318 2.2617 2.1963 2.4590 2.4931 5.1916 5.3168 6.5419 6.3656 5.7526 5.7733 1.0898 1.0897 1.0860 1.0860 1.0897 1.0897 1.0941 1.0941 1.0999 1.0999 1.0948 1.0949 1.0639 1.0639
irintensity: 0.1322 2.4548 1.2282 0.0584 0.8219 0.6737 3.6190 6.9711 0.1190 1.6861 0.4940 1.8341 23.2505 0.0058 1.1687 0.0700 0.9424 0.1421 4.3395 1.5914 10.0534 27.3181 0.0667 36.9761 27.6709 1.3011 1.0124 3.1099 1.0196 0.0045 97.4275 156.4770 170.3801 0.4632 3.8278 9.2481 43.3573 27.4640 70.9412 8.3861 39.4977 9.5886 48.9277 5.0396 2.8484 78.6472 1.3223 2.3526 55.3650 1.1668 12.9981 1.9281 3.7877 7.7065 0.1660 2.0101 1.0569 0.7044 0.0341 16.1655 0.5562 141.7883 28.8667 116.4094 0.0258 545.0893 1.4760 7.4063 0.0007 77.1239 0.0103 54.4151 0.0291 107.6107 6.8776 186.7766 7.3869 181.3796 0.4858 66.1402 9.1218 28.4013 0.0915 48.4070 1.0000 2.0199 3.9248 18.9274 195.0718 1.9719 165.1161 0.6670 11.7233 1.7837 0.1297 6.7681 1.0145 31.6634 10.4788 84.4715 1.8115 16.4436 5.5974 111.6016 0.9094
temp: 298.150 k
press: 1.00000 atm
elementType: 16 8 8 8 8 8 8 6 6 6 6 6 6 6 6 6 6 6 6 6 6 6 6 1 1 1 1 1 1 1 1 1 1 1 1 1 1
symmnumber: 1
zpe: 699103.9 jmol-1
zpe.correction: 0.266275 hartree
zpe.thermalcorrener: 0.289088 hartree
zpe.thermalcorrenthalpy: 0.290032 hartree
zpe.thermalcorrgfe: 0.210914 hartree
zpe.sumelectzpe: -1465.717920 hartree
zpe.sumelectthermal: -1465.695107 hartree
zpe.sumelectthermalent: -1465.694163 hartree
zpe.sumelectthermalfe: -1465.773280 hartree
dipole: -0.0024 0.0008 1.3411
dipole: 1.3411
quadrupole: -108.2111 -118.5314 -153.3155
quadrupole: 1.2701 0.0008 0.0012
quadrupole: 18.4749 8.1546 -26.6295 1.2701 0.0008 0.0012
hfenergy: -1465.9841948 hartree
pointgroup: C01 [X(C16H14O6S1)]
dipole: 0.0012236 -0.527629 0.0009966 debye
polarizability: 525.3598135|1.4980965|154.2555124|-19.5055546|0.0070074|232.3523426 unknown
InChI: InChI=1S/2C8H7O2.O2S/c2*9-8(10)6-7-4-2-1-3-5-7;1-3-2/h2*1-6,9H;
charge 0 multiplicity 1
37 atoms
S  -0.002989 0.724645 -0.001263
O  -0.453873 1.567136 1.322098
O  0.441539 1.566518 -1.327183
O  -2.06127 -0.620112 -2.863502
O  2.065646 -0.595902 2.864905
O  -0.226203 -1.798629 -2.083419
O  0.239961 -1.790943 2.088018
C  -1.709384 -0.810839 -0.455837
C  1.715343 -0.795831 0.457737
C  -2.951311 -0.188336 -0.013271
C  2.952229 -0.164451 0.0136
C  -1.272286 -1.134485 -1.836283
C  1.280725 -1.119168 1.839052
C  -3.243313 -0.273521 1.386532
C  3.244574 -0.250135 -1.386097
C  -3.849019 0.534174 -0.860458
C  3.844242 0.567032 0.859088
C  -4.406306 0.31275 1.915005
C  4.402653 0.344472 -1.91606
C  -5.01063 1.116943 -0.321833
C  5.001005 1.158033 0.318998
C  -5.296831 1.008709 1.061826
C  5.287739 1.049303 -1.064512
H  -1.250102 -1.504218 0.26383
H  1.261638 -1.494762 -0.260108
H  -2.542103 -0.799432 2.04516
H  2.547435 -0.782998 -2.043452
H  -3.629217 0.617741 -1.926484
H  3.623927 0.651086 1.924964
H  -4.617444 0.239129 2.986831
H  4.614097 0.270438 -2.987797
H  -5.696702 1.663214 -0.978156
H  5.68279 1.711177 0.974032
H  -6.201879 1.470368 1.47222
H  6.188914 1.517454 -1.476072
H  -1.633688 -0.841473 -3.735128
H  1.639794 -0.818287 3.737119
