program: Gaussian 09
title: 000269260
version: EM64L-G09RevD.01
frameworkgroup: C1[X(C7H10N2O2S)]
method: RPBEPBE
basis: SDD
operation: Freq
keyword: #p
keyword: freq=noraman
keyword: PBEPBE/SDD
title: #p freq=noraman PBEPBE/SDD
converged: NO NO NO NO
title: Mulliken charges:
elementType: S O O N N C C C C C C C H H H H H H H H H H
charge: 0.815841 -0.643677 -0.659074 -0.137693 -0.404248 -0.829253 0.490867 -0.364247 -0.344864 -0.238556 -0.223537 -0.234488 0.270212 0.272172 0.247469 0.252852 0.308533 0.230963 0.231838 0.232817 0.315804 0.410268
chargesum: 0.00000
title: Mulliken charges with hydrogens summed into heavy atoms:
elementType: S O O N N C C C C C C C
charge: 0.815841 -0.233408 -0.659074 0.170840 -0.088445 -0.286869 0.490867 -0.116778 -0.092011 -0.007594 0.008301 -0.001671
polarizability: 1.35869338e+02 1.67655179e+01 1.02851477e+02 2.56329330e+00 -2.50416683e+00 1.15091132e+02
1716.lowfreq: -17.7889 -7.7428 0.0018 0.0023 0.0025 13.2501 46.7655 47.5029 71.7876
frequency: 46.1111 47.4848 71.7647 88.6767 148.6350 200.3605 212.9560 229.5451 243.5422 321.3929 346.1681 374.9180 382.4805 402.6638 405.6900 520.3288 525.8923 575.3619 615.4445 649.5841 696.5226 766.8694 779.8111 813.3426 845.2972 884.2893 913.7227 970.5070 987.5174 994.4315 1027.0844 1060.4464 1111.6904 1133.0414 1170.1041 1173.6840 1191.4525 1236.2939 1288.0031 1310.9351 1329.2259 1387.8073 1430.9726 1438.8089 1483.8693 1485.1484 1584.8461 1585.7454 1607.3720 1619.7108 1708.3490 2596.9595 3049.9900 3126.5463 3136.1009 3138.4983 3147.5673 3156.1228 3169.3364 3255.1935
redmass: 5.7062 6.1897 4.0939 6.6624 4.3036 6.0310 7.2244 10.3384 6.5761 5.6997 2.2057 5.7043 5.6574 3.1035 4.8833 4.0960 1.2102 4.2923 6.3073 11.2397 1.7578 2.1141 7.5448 4.3675 1.2582 1.5951 1.4252 1.3879 6.2054 1.3149 2.1826 1.3959 1.1819 1.0920 1.1673 1.0549 1.1150 2.8634 1.1416 1.0633 1.2749 9.0494 1.1706 2.1647 2.8210 2.7386 1.6208 4.4866 5.8852 1.1022 1.0861 1.0791 1.0571 1.0850 1.0894 1.1087 1.0927 1.0970 1.1014 1.0756
irintensity: 0.1295 1.6230 0.2134 10.4946 2.4411 2.5720 0.8550 6.6781 13.1157 3.8052 1.5243 41.8061 20.4104 1.0868 2.7278 5.1930 9.3150 14.9536 0.0181 32.1082 52.8912 27.2831 60.9674 0.9042 1.5270 4.1537 1.2747 0.2481 0.0039 0.1714 3.2747 5.4894 4.4355 157.8454 4.7170 0.0948 0.0992 9.3957 54.6345 137.1065 0.6382 0.4399 10.3889 13.2391 37.1062 51.4335 46.0739 10.0602 4.2895 23.7424 965.7375 226.5607 14.8189 1.2213 3.3027 0.7613 18.6604 25.2820 12.4202 2.2720
temp: 298.150 k
press: 1.00000 atm
elementType: 16 8 8 7 7 6 6 6 6 6 6 6 1 1 1 1 1 1 1 1 1 1
symmnumber: 1
zpe: 425883.8 jmol-1
zpe.correction: 0.162211 hartree
zpe.thermalcorrener: 0.174848 hartree
zpe.thermalcorrenthalpy: 0.175792 hartree
zpe.thermalcorrgfe: 0.122563 hartree
zpe.sumelectzpe: -929.716229 hartree
zpe.sumelectthermal: -929.703592 hartree
zpe.sumelectthermalent: -929.702648 hartree
zpe.sumelectthermalfe: -929.755877 hartree
dipole: 2.5585 -0.8004 1.2657
dipole: 2.9645
quadrupole: -79.3386 -72.9801 -78.6411
quadrupole: 7.9468 1.8538 5.1649
quadrupole: -2.3520 4.0065 -1.6545 7.9468 1.8538 5.1649
hfenergy: -929.8784399 hartree
pointgroup: C01 [X(C7H10N2O2S1)]
dipole: -0.9152266 0.6490107 0.3185596 debye
dipolederiv: 0.6169908 0.0209442 0.2067667 -0.0277128 0.8929416 0.0782556 0.4074962 -0.0020744 0.2576504 -0.596494 -0.0306714 0.0457919 -0.2282017 -0.5888921 0.0019574 -0.3087157 -0.2654202 -0.8548498 -0.5089142 0.0340273 0.0108959 0.2650115 -0.6513488 -0.0937721 -0.2997736 0.1918037 -0.499213 -0.1021376 0.0556793 -0.0061295 0.1638355 -0.0956036 0.149224 -0.1084873 0.0032715 -0.3498019 -0.2238266 -0.0598502 -0.0349619 -0.1516548 -0.0578314 0.0098285 0.0286823 0.1356908 -0.1044792 -0.0332151 0.0195661 -0.0964897 0.0129668 0.0541877 0.0043143 -0.0503363 0.0082086 0.1137536 -0.0701253 0.0003981 -0.0722119 0.0027037 -0.0629319 0.015848 -0.2485713 0.0419916 -0.0081234 -0.1184591 0.0721667 -0.0780302 0.0400821 0.0239791 -0.0404484 0.0290104 -0.0957699 -0.0141891 -0.1017359 -0.078725 -0.0723954 -0.0193907 0.0545793 0.0493537 0.0420149 0.0713518 -0.0403441 -0.1277994 -0.0470416 -0.0352556 -0.0424737 0.0986112 0.0792058 -0.0797877 0.1091429 -0.0875755 -0.1242545 0.0391911 -0.0340418 0.0772075 0.0494732 -0.1201547 -0.0777802 -0.1381883 -0.0331404 -0.1303921 0.0029813 -0.0895124 -0.0278047 -0.0286999 0.0240227 -0.0557592 0.0068478 0.0730352 0.0170238 0.0166043 -0.011015 0.0081656 -0.0039839 0.1160945 0.0150312 0.0311834 0.0181501 0.0101128 -0.0205593 -0.0325448 -0.0098845 -0.0179127 -0.1061634 0.0079791 -0.0303688 0.0318974 0.1107853 -0.0524319 0.0514713 -0.0294382 0.002218 0.0591358 0.0278797 0.0799744 0.0276748 0.1205727 0.0521385 0.0357595 0.0131199 -0.0218278 -0.0544511 0.0113129 -0.0624272 0.055818 0.267119 -0.0391143 0.0299101 -0.0080507 0.1925291 0.0319247 0.1762471 -0.0521219 0.4203564 0.1363173 0.0239564 0.0328099 0.0474575 -0.0882014 -0.0746556 0.0531404 -0.070277 0.0635966 0.1317754 -0.0295144 0.0411415 -0.0517418 -0.0358301 0.0881312 0.0706694 0.0801677 0.0323887 0.1069199 0.0086326 0.0905072 0.0106593 0.0867305 -0.0229435 0.1115486 -0.0238654 -0.0767365 0.2651358 0.0313292 0.0552585 -0.0057196 0.1321278 -0.0848555 -0.0290931 -0.1109176 -0.059448 0.3546009 -0.0197074 -0.0377243 -0.0391363 0.0656858 -0.1098517 0.2772921 0.0917966 1.0335797 unknown
polarizability: 106.7258232|-3.7471428|116.2703864|-20.0135401|3.2857927|130.8157372 unknown
InChI: InChI=1S/C7H8O2S.H2N2/c8-10(9)6-7-4-2-1-3-5-7;1-2/h1-5,8H,6H2;1-2H
charge 0 multiplicity 1
22 atoms
S  1.933485 -0.538871 -2.218894
O  2.257609 0.953869 -1.317431
O  1.981693 -1.781189 -1.102893
N  1.892309 -0.862168 1.467668
N  2.032289 0.371285 1.157595
C  -0.067361 -0.281566 -2.46201
C  -0.700361 -0.110038 -1.131635
C  -0.898324 1.189361 -0.585686
C  -1.043711 -1.246333 -0.346843
C  -1.446416 1.347759 0.70629
C  -1.581282 -1.084748 0.949504
C  -1.788929 0.211249 1.477413
H  -0.106458 0.600447 -3.1189
H  -0.343469 -1.20534 -2.994692
H  -0.621747 2.068005 -1.178645
H  -0.8808 -2.249821 -0.753858
H  1.907684 -1.418344 0.526175
H  -1.610903 2.353546 1.109145
H  -1.837554 -1.966586 1.546475
H  -2.215695 0.333921 2.479103
H  2.014364 1.00001 1.990625
H  2.148377 0.782849 -0.211107
