program: Gaussian 09
title: 000269255
version: EM64L-G09RevD.01
frameworkgroup: C1[X(C20H15N)]
method: RPBEPBE
basis: SDD
operation: Freq
keyword: #pfreq=noraman
keyword: PBEPBE/SDD
title: #p freq=noraman PBEPBE/SDD
converged: YES YES NO NO
title: Mulliken charges:
elementType: N C C C C C C C C C C C C C C C C C C C C H H H H H H H H H H H H H H H
charge: -0.467344 0.190714 0.041010 -0.533622 0.168391 -0.602741 0.005073 0.248735 0.352679 0.317742 -0.452907 0.428214 -0.408366 -0.432434 -0.481254 -0.409321 -0.256027 -0.245504 -0.442258 -0.256768 -0.252961 0.229083 0.219748 0.224901 0.231123 0.315368 0.234391 0.213244 0.234421 0.231980 0.210562 0.226711 0.227029 0.238591 0.225423 0.226374
chargesum: 0.00000
title: Mulliken charges with hydrogens summed into heavy atoms:
elementType: N C C C C C C C C C C C C C C C C C C C C
charge: -0.151976 0.190714 0.041010 -0.084791 0.168391 -0.146717 0.005073 0.248735 0.352679 0.317742 -0.218516 0.428214 -0.195122 -0.198013 -0.249274 -0.198758 -0.029315 -0.018475 -0.203666 -0.031344 -0.026588
polarizability: 4.26439099e+02 1.12363532e+00 2.40466251e+02 1.15600007e+00 -9.71281257e-03 9.38732352e+01
1716.lowfreq: -10.2987 -2.8457 -0.0003 0.0001 0.0004 6.4330 47.8668 62.8779 100.2536
frequency: 47.8364 62.8299 100.2473 115.0963 142.0727 185.0677 215.8670 251.3881 263.6751 272.3807 301.3695 345.3352 404.6262 419.9001 427.2527 456.6178 474.9318 498.3598 502.6332 526.1233 534.3711 551.9307 572.8885 590.2488 605.3143 652.0527 663.2282 692.1424 705.8676 719.9656 746.0664 753.5537 767.7183 770.0705 797.0247 800.9708 820.9325 865.1417 870.2483 873.2044 888.6023 938.6383 946.4208 961.7807 965.5572 979.6653 983.7748 987.7099 1026.9338 1027.9733 1041.1551 1050.6629 1080.8095 1122.3008 1147.6942 1165.3768 1173.7750 1174.3094 1178.4633 1201.6888 1208.8770 1221.3066 1235.5467 1270.5177 1280.5717 1304.6973 1309.7526 1336.1729 1368.4276 1375.1766 1386.1495 1403.8504 1416.4133 1433.6797 1438.6173 1448.1084 1461.4584 1464.9070 1479.3867 1504.1939 1537.6781 1551.7547 1569.5421 1585.8904 1605.5830 1617.4413 1635.2700 2951.9855 2959.5384 3031.3171 3041.7706 3109.4173 3112.0349 3120.2615 3121.1204 3123.4467 3138.9326 3139.8254 3148.5462 3161.0356 3161.2279 3612.7799
redmass: 5.0181 4.0387 4.9383 4.1552 3.4005 3.2583 3.3009 4.7129 6.0508 3.1262 3.6055 4.1387 4.6244 3.0108 3.0867 3.8123 5.4167 3.6027 4.5517 1.5415 2.4013 4.4975 3.2764 4.5358 5.7399 6.2430 3.9641 3.9659 3.8622 2.3904 1.9507 1.6742 3.2282 2.2300 2.7972 4.7061 1.5949 1.4938 3.6483 1.7693 2.3677 1.4048 1.3611 4.1653 1.3678 1.3301 1.3628 3.1419 2.3391 2.3911 2.1280 2.5745 2.8318 1.8213 1.3117 1.2355 1.1234 1.0937 1.7229 2.2133 1.5234 1.8324 2.0080 1.7008 1.5093 1.5536 1.4433 1.7860 3.4144 3.5227 3.3198 7.5822 2.2702 2.3008 3.3164 1.1320 1.8833 1.3860 4.5778 3.9624 5.0111 7.2230 6.3251 6.7896 6.6037 6.7576 6.7457 1.0694 1.0630 1.0933 1.0953 1.0872 1.0870 1.0884 1.0877 1.0864 1.0926 1.0936 1.0975 1.1002 1.1003 1.0799
irintensity: 0.4403 0.0756 0.1047 0.4017 0.2662 0.7172 0.2400 1.1499 0.4275 1.6850 7.9921 1.1592 0.7066 4.3041 3.5729 3.4339 5.4413 3.5284 3.7006 47.7037 23.9552 8.0293 11.5349 3.6765 2.1802 0.3017 6.5710 13.9832 0.2424 17.6290 5.2606 45.2799 33.6565 50.3717 0.1642 2.2067 64.7641 1.4903 3.3125 7.0916 3.9010 2.3523 2.6442 4.2934 1.5970 0.0273 0.7560 0.1107 1.8926 8.3110 9.6971 1.6788 10.5067 10.5832 0.9527 1.3598 0.3910 0.1763 2.0610 2.1372 2.9316 1.3385 9.5212 5.9782 2.2964 63.9905 8.8113 8.7971 5.7141 2.6123 35.0417 5.5968 0.6830 47.0296 22.6181 15.6683 2.3704 11.7709 8.1221 27.4617 5.1346 3.4109 0.5170 1.5478 9.7417 20.8025 15.9422 32.2082 37.9804 32.5196 40.6889 11.8618 19.1331 4.6962 0.9525 4.4805 25.4584 27.6019 34.1002 63.6692 22.8868 31.4063
temp: 298.150 k
press: 1.00000 atm
elementType: 7 6 6 6 6 6 6 6 6 6 6 6 6 6 6 6 6 6 6 6 6 1 1 1 1 1 1 1 1 1 1 1 1 1 1 1
symmnumber: 1
zpe: 758396.9 jmol-1
zpe.correction: 0.288858 hartree
zpe.thermalcorrener: 0.303884 hartree
zpe.thermalcorrenthalpy: 0.304828 hartree
zpe.thermalcorrgfe: 0.247043 hartree
zpe.sumelectzpe: -824.517912 hartree
zpe.sumelectthermal: -824.502886 hartree
zpe.sumelectthermalent: -824.501941 hartree
zpe.sumelectthermalfe: -824.559727 hartree
dipole: -0.9416 -0.6589 0.1981
dipole: 1.1662
quadrupole: -109.7972 -103.8884 -130.2947
quadrupole: -2.0430 -0.3275 0.0051
quadrupole: 4.8629 10.7717 -15.6346 -2.0430 -0.3275 0.0051
hfenergy: -824.80677 hartree
pointgroup: C01 [X(C20H15N1)]
dipole: -0.3734291 0.2550838 -0.0773306 debye
polarizability: 426.4402814|1.0478674|240.4644649|-1.1143268|0.3576758|93.8738394 unknown
InChI: InChI=1S/C20H15N/c1-3-7-15-13(5-1)9-11-17-18-12-10-14-6-2-4-8-16(14)20(18)21-19(15)17/h1-9,11,21H,10,12H2
charge 0 multiplicity 1
36 atoms
N  -0.008895 0.91796 -0.065973
C  -0.713469 -1.248744 0.073989
C  -1.139987 0.085626 -0.020984
C  -1.726352 -2.361072 0.2068
C  0.72622 -1.238498 0.088301
C  -3.042136 -1.95511 -0.513306
C  1.143238 0.130178 -0.008147
C  -2.538263 0.499515 -0.000345
C  -3.511503 -0.537462 -0.188096
C  2.518464 0.526501 -0.038047
C  1.721648 -2.267888 0.16943
C  3.497793 -0.541352 0.042961
C  -2.968242 1.835285 0.216923
C  -4.881119 -0.204539 -0.140158
C  3.068561 -1.918143 0.146016
C  2.968122 1.88152 -0.137007
C  -4.34336 2.151558 0.247046
C  -5.304934 1.130163 0.072932
C  4.886101 -0.196678 0.019444
C  4.335026 2.182991 -0.157038
C  5.303179 1.136238 -0.078586
H  -1.929923 -2.561994 1.279969
H  -1.345577 -3.305881 -0.224287
H  -3.844131 -2.680723 -0.284457
H  -2.8625 -2.011327 -1.608349
H  -0.029092 1.928421 -0.180435
H  1.420265 -3.318213 0.248558
H  -2.232622 2.631702 0.386479
H  -5.628305 -0.995328 -0.280293
H  3.840127 -2.694781 0.206323
H  2.238788 2.699323 -0.196973
H  -4.663378 3.185587 0.416086
H  -6.373688 1.368472 0.105166
H  5.627977 -1.002129 0.080514
H  4.665774 3.22466 -0.232962
H  6.370792 1.380763 -0.095095
