program: Gaussian 09
title: 000269253
version: EM64L-G09RevD.01
frameworkgroup: C1[X(C5H6Br2N2O)]
method: RPBEPBE
basis: SDD
operation: Freq
keyword: #p
keyword: freq=noraman
keyword: PBEPBE/SDD
title: #p freq=noraman PBEPBE/SDD
converged: NO YES NO NO
title: Mulliken charges:
elementType: Br Br O N N C C C C C H H H H H H
charge: 0.124424 0.126495 -0.170232 -0.406697 -0.007249 0.380182 -0.807746 -0.411447 0.325807 -0.671532 0.241171 0.241832 0.357001 0.217692 0.229905 0.230394
chargesum: 0.00000
title: Mulliken charges with hydrogens summed into heavy atoms:
elementType: Br Br O N N C C C C C
charge: 0.124424 0.126495 -0.170232 -0.049696 -0.007249 0.380182 -0.807746 0.071556 0.325807 0.006459
polarizability: 1.03140846e+02 -1.61514395e-01 9.88935895e+01 7.69880768e-01 2.53795925e-01 1.02183714e+02
1716.lowfreq: -9.9250 -0.0004 -0.0001 -0.0001 7.1205 7.8554 43.7964 70.5419 108.1615
frequency: 43.7829 70.5373 108.1595 126.7514 147.8259 150.3830 198.6610 204.2551 264.0349 335.5726 376.6568 452.9687 541.0942 615.9283 619.4851 646.1023 728.8715 744.4240 793.8867 848.2458 937.0333 992.1906 1033.4838 1083.8783 1086.8303 1163.3631 1230.5194 1247.3862 1347.0879 1377.5327 1398.0244 1448.7138 1471.3444 1481.3414 1547.4596 1680.7950 2974.6249 3000.5373 3014.6111 3099.3714 3101.2700 3615.0788
redmass: 2.4730 5.5663 4.6465 7.3627 4.4572 8.9023 7.0235 1.3610 6.5162 4.3260 6.6434 6.3375 6.8865 1.3234 3.6473 4.9333 8.1198 3.8382 1.5434 5.9149 8.0051 1.9365 4.8514 2.5955 1.5282 5.6065 3.1555 1.1498 1.5195 1.9172 1.2074 1.1597 1.0398 1.0610 5.0995 10.2971 1.0600 1.0357 1.0982 1.1007 1.1002 1.0816
irintensity: 0.1007 0.0012 0.9489 0.3747 0.0062 0.6134 0.2801 0.1121 1.0108 1.9068 7.6497 18.4793 19.2763 81.1678 11.1392 117.3808 30.6547 87.1968 5.6830 31.5380 17.9640 31.1888 9.0657 13.3582 4.1473 73.2824 18.8358 1.0245 23.4420 2.9790 13.1258 14.3217 12.9320 15.1014 1.2161 298.4578 12.1902 24.2713 5.1946 28.6106 27.2801 76.3198
temp: 298.150 k
press: 1.00000 atm
elementType: 35 35 8 7 7 6 6 6 6 6 1 1 1 1 1 1
symmnumber: 1
zpe: 283216.5 jmol-1
zpe.correction: 0.107871 hartree
zpe.thermalcorrener: 0.118836 hartree
zpe.thermalcorrenthalpy: 0.119780 hartree
zpe.thermalcorrgfe: 0.068653 hartree
zpe.sumelectzpe: -404.991686 hartree
zpe.sumelectthermal: -404.980721 hartree
zpe.sumelectthermalent: -404.979777 hartree
zpe.sumelectthermalfe: -405.030904 hartree
dipole: -3.3539 -0.1050 -0.8076
dipole: 3.4513
quadrupole: -81.9541 -75.6140 -72.0993
quadrupole: -0.1629 -3.6179 0.1141
quadrupole: -5.3983 0.9418 4.4565 -0.1629 -3.6179 0.1141
hfenergy: -405.0995572 hartree
pointgroup: C01 [X(C5H6Br2N2O1)]
dipole: -1.3160931 0.3083361 -0.1288269 debye
dipolederiv: -0.0425293 0.0872797 0.043324 0.0172306 -0.3542684 -0.3471158 0.0357445 -0.261672 -0.4023845 -0.0334873 0.0472384 -0.0376927 -0.0137326 -0.1019551 0.1832714 0.0031491 0.1004106 -0.6478957 -1.1994015 -0.1529621 -0.0055276 0.0304672 -0.3753308 0.028142 -0.0512652 0.021175 -0.2779767 -1.0785876 -0.2161599 0.0261948 0.6476548 -0.318421 0.0292136 -0.2118586 -0.0094096 -0.3267249 0.5257476 0.5349673 -0.117893 0.1194873 -0.2372028 0.0513952 -0.0041935 0.0689617 -0.0794642 0.5408204 -0.0273025 0.0336266 0.0122938 -0.0284132 -0.0460168 0.0186548 -0.0436607 -0.1956105 -0.2466682 -0.4839661 0.0593575 -0.2028638 0.2629961 0.2775331 -0.0120593 0.2659418 1.3121823 -0.0530742 -0.0033139 -0.0057337 -0.0781827 -0.0386414 0.0386958 0.0266629 0.0493667 0.1076382 1.3519185 0.2251902 0.0044711 -0.5588088 0.7965634 -0.2201407 0.2159024 -0.1891705 0.1042454 0.0077544 0.0534892 -0.0192304 0.0128628 0.0486013 0.0111883 -0.0117261 0.011281 0.0757391 0.0229436 0.0133815 0.025347 0.0184372 -0.0386421 -0.0785022 -0.0146995 -0.1120577 0.0445694 0.0202961 -0.0153748 -0.020606 0.0121218 0.0751358 0.0624875 0.0061235 0.0915758 -0.0701678 0.1482078 0.0330825 -0.0186429 0.0218094 0.2680448 0.0294348 -0.0158448 0.0295673 0.3637422 -0.1552787 -0.0701208 0.0061483 -0.1203885 0.0355922 0.012926 0.0199101 0.015989 0.1001258 0.0930266 -0.0087778 0.0491818 0.0346873 0.0570698 0.0655154 -0.0022192 0.0667232 -0.1069506 0.0983119 -0.0166511 -0.0223247 0.0469242 -0.0511286 -0.0980277 -0.002281 -0.1050216 -0.0010673 unknown
polarizability: 103.5415871|0.148908|101.450594|0.3223825|-0.9288965|99.2259679 unknown
InChI: InChI=1S/C5H6Br2N2O/c1-2-3-5(6,7)4(10)9-8-3/h9H,2H2,1H3
charge 0 multiplicity 1
16 atoms
Br 0.854676 -2.110713 -1.079692
Br 0.726807 -1.286866 2.129796
O  2.84846 0.476131 0.053393
N  0.79175 1.599796 -0.346952
N  -0.605909 1.343158 -0.336054
C  -0.782308 0.070483 0.002749
C  0.546638 -0.619974 0.242312
C  -2.13861 -0.56433 0.120878
C  1.602712 0.516854 -0.016048
C  -3.302651 0.383409 -0.23011
H  -2.160327 -1.460162 -0.532542
H  -2.254276 -0.950401 1.154176
H  1.111266 2.536099 -0.586967
H  -4.264764 -0.148788 -0.132345
H  -3.213124 0.757062 -1.264395
H  -3.31904 1.260739 0.438804
