program: Gaussian 09
title: 000269248
version: EM64L-G09RevD.01
frameworkgroup: C1[X(C10H9N3O3)]
method: RPBEPBE
basis: SDD
operation: Freq
keyword: #p
keyword: freq=noraman
keyword: PBEPBE/SDD
title: #p freq=noraman PBEPBE/SDD
converged: NO YES NO NO
title: Mulliken charges:
elementType: O O O N N N C C C C C C C C C C H H H H H H H H H
charge: -0.209704 -0.209358 -0.207164 -0.392943 -0.032594 0.025426 -0.356541 0.095649 0.399989 0.181556 -0.674162 -0.361399 -0.345873 -0.382944 -0.369940 0.384949 0.279295 0.234717 0.231041 0.256177 0.348162 0.246464 0.280588 0.288930 0.289681
chargesum: 0.00000
title: Mulliken charges with hydrogens summed into heavy atoms:
elementType: O O O N N N C C C C C C C C C C
charge: -0.209704 -0.209358 -0.207164 -0.044781 -0.032594 0.025426 -0.077246 0.095649 0.399989 0.181556 0.047772 -0.114935 -0.065285 -0.094014 -0.080259 0.384949
polarizability: 2.92043876e+02 8.87790885e+00 1.36939448e+02 4.28354702e+00 -9.58845168e+00 6.70549996e+01
1716.lowfreq: -14.4743 -3.5312 -0.0005 -0.0004 -0.0002 1.7660 42.3181 50.6518 76.7903
frequency: 42.3007 50.5918 76.7840 84.6739 105.9273 170.3365 205.1189 214.0013 234.7439 255.7908 279.9380 353.0417 374.1038 411.8048 467.7027 489.0468 500.0941 529.8980 613.5894 624.8412 640.5481 662.2016 668.5304 681.9524 723.5057 749.2929 790.2131 800.6053 819.0231 846.3878 874.6772 985.5627 988.5425 1002.9243 1008.3996 1030.6285 1037.1784 1070.6137 1093.3220 1094.8895 1117.8574 1180.0169 1187.7893 1213.9798 1219.7621 1250.9735 1297.9622 1325.7282 1357.5029 1377.0361 1391.8797 1399.6369 1422.2780 1470.9101 1475.7710 1481.1109 1511.9105 1586.4178 1610.6520 1674.4033 2999.6330 3009.8367 3102.7166 3105.8920 3153.6224 3165.5798 3184.4842 3187.9817 3597.1638
redmass: 7.8564 6.7410 4.8656 7.0305 5.9119 4.6949 1.0444 5.2718 5.7396 6.5837 5.3723 7.8094 6.4974 2.9117 8.0667 4.1584 6.0251 4.5502 2.6563 7.1099 1.4938 7.2584 4.6020 4.7940 7.0349 4.6191 8.9602 2.9251 3.5165 1.3117 1.5716 2.8087 1.4545 2.5142 1.4104 1.8264 2.7869 2.8224 2.3818 2.4551 1.4241 1.4646 4.8146 1.6411 4.4344 1.5088 1.3026 2.3425 4.7770 2.1076 1.9013 2.5650 4.1912 1.0523 3.4630 1.0636 4.6890 7.9061 6.2192 9.3423 1.0345 1.0828 1.1012 1.1013 1.0896 1.0895 1.0951 1.0968 1.0815
irintensity: 1.2995 2.4408 0.9710 1.5140 1.2746 2.7699 0.3576 1.1924 0.8545 1.6193 3.2562 1.1915 2.2679 0.0918 16.1300 11.3563 4.8754 4.7920 35.5483 0.3201 86.4276 11.2284 16.0248 30.7346 34.1199 3.6969 18.8550 1.9616 26.5377 9.6141 57.7601 35.3084 7.7735 2.1484 1.8724 5.3110 153.6179 4.5301 18.3293 72.3607 51.5894 163.4994 147.1918 1.4605 379.3866 8.9260 2.1155 56.1288 58.7993 38.7590 17.4930 21.9950 28.8645 16.4660 35.6175 5.9105 30.2569 6.9996 97.6084 492.2627 16.3016 2.8509 14.1314 12.4464 8.8657 0.6114 0.9580 1.9750 98.4830
temp: 298.150 k
press: 1.00000 atm
elementType: 8 8 8 7 7 7 6 6 6 6 6 6 6 6 6 6 1 1 1 1 1 1 1 1 1
symmnumber: 1
zpe: 476794.5 jmol-1
zpe.correction: 0.181601 hartree
zpe.thermalcorrener: 0.195276 hartree
zpe.thermalcorrenthalpy: 0.196220 hartree
zpe.thermalcorrgfe: 0.140098 hartree
zpe.sumelectzpe: -775.157563 hartree
zpe.sumelectthermal: -775.143889 hartree
zpe.sumelectthermalent: -775.142944 hartree
zpe.sumelectthermalfe: -775.199067 hartree
dipole: -3.5222 -0.1659 0.3144
dipole: 3.5401
quadrupole: -137.3711 -84.7934 -91.2880
quadrupole: 4.5434 -2.1176 -0.6596
quadrupole: -32.8869 19.6908 13.1962 4.5434 -2.1176 -0.6596
hfenergy: -775.3391646 hartree
pointgroup: C01 [X(C10H9N3O3)]
dipole: -1.3846834 -0.0621961 0.1363289 debye
dipolederiv: -1.5158074 0.2119643 -0.0858758 0.558006 -0.4826588 0.0124896 -0.0555658 0.0075962 -0.3448473 -0.8548706 -0.2049735 0.030432 -0.4247831 -0.6900623 0.0797263 0.0670916 0.0801619 -0.2449096 -0.9303669 0.1835692 -0.0411398 0.3817831 -0.6123863 0.0752748 -0.0798936 0.0732244 -0.2441151 -1.498182 -0.1539149 -0.0291043 1.3156543 -0.4518245 0.0148435 -0.0269819 0.0058264 -0.3144078 1.2970973 0.2260146 0.0398214 0.0918097 -0.3031919 -0.0395484 -0.0079559 0.0131504 -0.1246667 2.3847134 0.0753706 0.0141232 0.09706 1.0585789 -0.1587023 0.0164825 -0.1574645 0.2189806 -0.2939782 -0.0875548 -0.0410898 -0.1315448 -0.2237219 -0.113192 0.0237561 -0.0999194 0.1211127 -0.1407502 -0.1404955 -0.0379451 -0.7706142 0.1620845 0.0273343 -0.0075321 -0.0407622 -0.0504642 0.7720429 0.0835676 0.0055381 0.2232088 0.0645648 -0.0207992 0.0438333 -0.009632 0.0279338 1.4632414 -0.1983981 0.1342346 -1.4039331 0.8890999 -0.0099089 0.0721202 -0.0308921 0.1872691 0.0288818 0.0181337 -0.0097558 0.0271066 0.0912269 0.0111316 -0.0288654 0.0708011 0.1001385 -0.379855 -0.1813502 0.0297542 -0.3496676 -0.0285409 -0.0227748 0.0565563 -0.0257652 -0.1380215 -0.5001894 0.1318696 -0.0296456 0.2401732 0.0439465 -0.0277367 -0.034861 -0.018628 -0.1138281 0.3574676 0.140556 -0.0196596 -0.1361996 -0.0373064 -0.0167954 0.0274221 -0.0127246 -0.0971453 0.3496315 -0.1079199 0.0303024 0.2328018 -0.0176562 -0.0159521 -0.0318563 -0.0153265 -0.0957289 -1.1534591 -0.0669769 -0.0010252 -0.0848103 0.0473541 -0.0000046 -0.0094547 -0.0016742 0.0526526 0.0981375 -0.0069549 0.0357862 -0.0189509 0.0685319 0.0559085 0.0207849 0.0450189 -0.0090577 0.0911714 -0.0070298 0.0070359 -0.0286357 0.0105856 0.1120549 0.0005901 0.0408797 -0.0548947 -0.034141 -0.1216442 -0.0193637 -0.1069837 0.0395473 -0.0275787 -0.0062804 -0.0027996 0.0651505 -0.0279147 0.1242871 0.0093691 0.0692231 0.0099785 -0.0216336 -0.0175238 -0.0123595 0.0805297 0.2048124 0.0457403 -0.0052385 0.1559725 0.2164367 -0.0024845 0.0026446 0.0053204 0.3682113 0.0241918 0.0881904 -0.0246904 0.0944236 -0.0122544 0.0226082 -0.0367085 0.0262393 0.1353607 0.0751223 -0.0625755 0.0111259 -0.0325636 0.0261283 0.0259096 0.0137131 0.0194808 0.1438656 0.099775 -0.0493435 0.0092057 -0.0158982 0.0593128 0.0212275 0.0063822 0.0207053 0.1661924 0.083228 0.0598685 -0.0121951 0.0173622 0.0722267 0.0186025 -0.0078977 0.0195429 0.1646893 unknown
polarizability: 292.2359636|7.4949309|137.6527491|2.0512314|-5.9138716|66.1496104 unknown
InChI: InChI=1S/C10H9N3O3/c1-6-9(11-12-10(6)14)7-2-4-8(5-3-7)13(15)16/h2-6,12H,1H3
charge 0 multiplicity 1
25 atoms
O  -5.089246 0.496042 -0.183897
O  4.702406 1.249547 -0.216422
O  4.863848 -0.990363 0.192964
N  -3.5458 -1.310535 -0.111786
N  -2.161738 -1.539038 -0.063946
N  4.178123 0.085239 -0.014352
C  -2.574743 0.806351 -0.050446
C  -1.5681 -0.338895 -0.04683
C  -0.106514 -0.227695 -0.031591
C  -3.919927 0.045826 -0.136583
C  -2.556038 1.712424 1.211549
C  0.529201 1.028274 -0.252442
C  0.703291 -1.381992 0.190844
C  1.930718 1.136792 -0.250275
C  2.102189 -1.286802 0.197459
C  2.701435 -0.023556 -0.021895
H  -2.466938 1.438186 -0.953081
H  -2.637372 1.107664 2.130987
H  -1.626405 2.302389 1.270089
H  -3.416245 2.402385 1.172648
H  -4.174578 -2.112256 -0.14105
H  -0.072909 1.921627 -0.44511
H  0.210812 -2.344186 0.357775
H  2.436507 2.090177 -0.422785
H  2.738524 -2.158703 0.368978
