program: Gaussian 09
title: 000269247
version: EM64L-G09RevD.01
frameworkgroup: C1[X(C6H8Br2N2O)]
method: RPBEPBE
basis: SDD
operation: Freq
keyword: #p
keyword: freq=noraman
keyword: PBEPBE/SDD
title: #p freq=noraman PBEPBE/SDD
converged: NO YES NO NO
title: Mulliken charges:
elementType: Br Br O N N C C C C C C H H H H H H H H
charge: 0.129897 0.120574 -0.171753 -0.002909 -0.402976 -0.438645 0.401883 -0.840202 -0.355238 0.317901 -0.684507 0.233138 0.234387 0.222747 0.223930 0.212305 0.216087 0.226414 0.356966
chargesum: 0.00000
title: Mulliken charges with hydrogens summed into heavy atoms:
elementType: Br Br O N N C C C C C C
charge: 0.129897 0.120574 -0.171753 -0.002909 -0.046010 0.028880 0.401883 -0.840202 0.091439 0.317901 -0.029700
polarizability: 1.23470131e+02 -3.47817665e+00 1.07266177e+02 3.39127661e+00 -1.08638456e+00 1.10065132e+02
1716.lowfreq: -13.6128 -0.0006 -0.0005 -0.0004 5.1569 8.3750 16.6637 50.4803 67.0529
frequency: 7.9135 50.4710 66.9895 86.6909 131.1668 139.1001 159.9240 186.0281 226.0230 233.1258 299.6308 355.6407 368.6223 466.7735 532.1215 602.4762 624.2144 674.0468 737.9898 744.7379 770.2783 853.6008 867.8181 906.6032 944.0410 1013.3661 1052.2638 1089.9524 1101.7135 1174.8127 1219.7214 1259.4942 1282.8133 1313.3530 1336.8870 1368.9519 1391.3610 1459.4731 1475.0589 1477.1718 1485.6702 1529.5842 1676.8788 2977.1269 2991.8129 3001.6061 3039.1731 3061.3834 3079.9642 3080.8112 3614.3267
redmass: 2.6472 5.2340 2.1145 11.1860 9.2146 15.6441 5.5924 5.5580 1.2299 4.5972 3.5627 4.7194 8.0605 5.4448 5.4925 2.6894 1.6213 11.1073 1.2267 4.9701 9.9901 1.6902 1.9239 2.9656 9.6100 3.0138 2.9571 2.0304 2.1406 5.3647 1.7736 1.4781 1.1769 1.5661 1.4581 1.7079 1.2132 1.1202 1.0509 1.0448 1.0831 7.1057 10.2458 1.0358 1.0601 1.0599 1.1001 1.1018 1.0991 1.1029 1.0817
irintensity: 0.0686 0.0071 0.0058 0.2028 0.2589 0.0805 1.5331 0.0897 0.0257 0.6250 0.4716 3.2467 4.9343 17.3386 15.2768 21.0465 183.3428 10.4609 10.4230 34.0039 81.7151 20.1506 14.4251 12.8046 17.1746 23.6662 0.8929 27.7492 11.0531 71.2539 5.9146 3.3868 2.6895 25.5515 22.4366 2.2053 9.5913 3.5495 4.3929 12.0577 16.9915 1.1189 303.6908 33.6202 0.4526 31.9089 0.1595 0.1501 38.5201 65.1546 78.0596
temp: 298.150 k
press: 1.00000 atm
elementType: 35 35 8 7 7 6 6 6 6 6 6 1 1 1 1 1 1 1 1
symmnumber: 1
zpe: 356431.9 jmol-1
zpe.correction: 0.135758 hartree
zpe.thermalcorrener: 0.148233 hartree
zpe.thermalcorrenthalpy: 0.149177 hartree
zpe.thermalcorrgfe: 0.092729 hartree
zpe.sumelectzpe: -444.213816 hartree
zpe.sumelectthermal: -444.201341 hartree
zpe.sumelectthermalent: -444.200396 hartree
zpe.sumelectthermalfe: -444.256845 hartree
dipole: -3.3436 -1.1521 0.1159
dipole: 3.5384
quadrupole: -89.1348 -82.5227 -78.3342
quadrupole: -3.4223 -0.2896 -2.0019
quadrupole: -5.8043 0.8079 4.9964 -3.4223 -0.2896 -2.0019
hfenergy: -444.3495739 hartree
pointgroup: C01 [X(C6H8Br2N2O1)]
dipole: -1.2826117 0.4827783 0.2446446 debye
dipolederiv: -0.0568672 0.1079613 -0.1137808 0.046137 -0.256971 0.3183988 -0.1041354 0.218896 -0.4736302 -0.0652991 0.000732 -0.1185666 -0.0940608 -0.1780762 -0.2545038 -0.1411615 -0.1927336 -0.5343319 -1.1631237 -0.0537429 0.1971949 0.1475937 -0.3780532 -0.0379199 0.23438 0.004454 -0.3200315 0.5675345 0.4282197 -0.0959296 -0.0039401 -0.3337049 -0.042019 -0.1649896 -0.1319957 -0.0535402 -0.9957301 -0.1403758 0.1003785 0.7470809 -0.3827745 -0.1659433 0.2463105 0.0266078 -0.3579721 -0.2590405 -0.0506366 -0.0306129 0.101851 0.1155896 0.018222 -0.1498385 0.0195031 0.06564 0.5763441 -0.0835525 -0.1357076 -0.1298245 -0.0052428 0.0810667 -0.2295474 0.0305002 -0.174457 -0.2158674 -0.4404604 0.3515647 -0.1379898 0.259451 -0.0639312 0.3997736 0.0391157 1.2753506 0.1599755 -0.0160614 0.0276343 -0.1178573 0.0972406 0.0260403 0.187778 0.0316069 0.090618 1.2242724 0.1708988 -0.276815 -0.6459736 0.8918094 0.1945249 -0.3606174 0.0282499 0.1326458 -0.096448 -0.0333523 -0.0031217 0.0169647 0.0904294 0.0199005 -0.0795418 0.0133085 0.0731566 0.0174872 0.009479 0.0540868 -0.000147 0.046367 -0.0736908 0.0660947 -0.0364261 -0.063447 0.066538 0.015433 -0.013562 0.0000572 -0.0931686 0.0425837 -0.0043091 0.0147472 0.06928 0.0238644 0.022822 0.0734127 0.024541 0.0479236 -0.0833353 0.0506295 -0.0538053 -0.1001119 0.0276812 -0.0395289 -0.0117095 -0.0102616 -0.1311452 0.0493542 -0.0160587 0.0152908 0.0720657 0.0451006 0.0031806 0.0419513 0.0263092 0.0451768 -0.0955595 0.1185307 -0.0843879 -0.1084962 0.0746157 0.0249244 0.0079722 -0.0503895 -0.1691949 0.0279336 0.0268816 0.0256824 0.0855899 -0.100723 0.0296083 -0.1048632 0.039449 0.0805261 0.053378 -0.1355566 0.0522471 -0.032348 0.1696854 0.0444516 0.0504738 0.0404604 0.2538179 -0.0144997 0.0553772 -0.0208609 0.3540194 unknown
polarizability: 124.0592308|1.6852285|109.1676461|3.7499725|-0.4678511|107.5745635 unknown
InChI: InChI=1S/C6H8Br2N2O/c1-2-3-4-6(7,8)5(11)10-9-4/h10H,2-3H2,1H3
charge 0 multiplicity 1
19 atoms
Br 1.292806 -1.840889 1.506202
Br 0.509158 -1.620118 -1.702655
O  3.199485 0.20865 -0.528744
N  0.016117 1.574995 0.384424
N  1.397102 1.645534 0.053149
C  -1.750691 -0.152296 0.638893
C  -0.342984 0.294535 0.355469
C  0.829846 -0.591558 -0.005126
C  -2.759768 0.260262 -0.473152
C  2.009731 0.424412 -0.214576
C  -4.192776 -0.203947 -0.142762
H  -2.082591 0.287308 1.598821
H  -1.761853 -1.251022 0.761695
H  -2.435422 -0.173045 -1.43827
H  -2.728428 1.360052 -0.58683
H  -4.546515 0.234491 0.809169
H  -4.244387 -1.304653 -0.047756
H  -4.898773 0.098974 -0.936613
H  1.845941 2.559012 0.029861
