program: Gaussian 09
title: 000269239
version: EM64L-G09RevD.01
frameworkgroup: C1[X(C9H7Cl2N3O2)]
method: RPBEPBE
basis: SDD
operation: Freq
keyword: #p
keyword: freq=noraman
keyword: PBEPBE/SDD
title: #p freq=noraman PBEPBE/SDD
converged: NO YES NO NO
title: Mulliken charges:
elementType: Cl Cl O O N N N C C C C C C C C C H H H H H H H
charge: -0.018423 -0.020111 -0.284797 -0.297735 -0.469263 -0.080772 -0.378289 0.352949 0.032796 0.126579 -0.347958 -0.322810 -0.055414 -0.075128 0.295393 -0.489330 0.375219 0.269730 0.278958 0.370635 0.247845 0.242077 0.247849
chargesum: 0.00000
title: Mulliken charges with hydrogens summed into heavy atoms:
elementType: Cl Cl O O N N N C C C C C C C C C
charge: -0.018423 -0.020111 -0.284797 -0.297735 -0.094044 -0.080772 -0.007654 0.352949 0.032796 0.126579 -0.078228 -0.043851 -0.055414 -0.075128 0.295393 0.248440
polarizability: 2.75934934e+02 -5.08083362e-01 1.35803346e+02 4.77508934e-03 -1.34601146e-02 5.94967871e+01
1716.lowfreq: -5.8552 -3.8148 -2.2826 0.0021 0.0022 0.0030 38.7203 58.5528 76.6030
frequency: 38.7157 58.5502 76.6021 79.4551 103.6343 124.4878 165.6658 184.7668 195.3421 244.8138 255.1736 295.4442 309.8235 339.2947 390.8461 392.4485 425.8109 428.4286 526.5298 628.8621 631.4104 655.3219 676.4701 679.7086 708.4697 716.5983 735.5049 742.0448 756.6493 844.8762 853.3862 873.8624 895.7738 925.5531 977.0742 1046.8826 1082.7948 1120.3556 1153.9549 1169.8344 1186.1224 1220.8608 1233.1004 1277.0901 1370.1797 1391.6591 1409.0895 1434.1175 1448.1220 1454.1503 1464.8530 1474.8394 1563.1889 1595.2063 1625.5729 1651.3037 3010.5504 3115.0328 3157.4676 3175.5144 3186.3906 3505.5748 3558.1902
redmass: 6.3676 1.2289 4.9007 6.1474 5.1566 7.4703 4.9550 27.3974 6.6359 9.0423 7.9900 7.5650 6.3188 8.0100 8.5085 9.5284 9.4143 3.0186 5.6978 6.8325 7.4656 1.4367 5.7729 11.4765 3.4478 8.6365 6.2094 2.8897 1.2661 4.1646 1.5184 1.4740 8.4614 7.2296 8.0678 4.3083 1.9010 1.2525 1.4792 2.7678 2.6579 1.6751 1.6175 6.3095 4.0451 5.4869 3.0415 1.5187 5.7697 1.0488 1.1549 2.0344 6.1226 8.4669 7.1738 7.5501 1.0297 1.1054 1.1049 1.0935 1.0934 1.0828 1.0775
irintensity: 0.2434 0.0043 1.7482 1.1110 1.8743 3.0561 8.7416 0.1955 0.4735 9.0598 4.0188 15.2566 2.9671 29.8246 6.3471 0.8591 11.7560 8.4897 14.5749 3.2540 31.0170 68.6812 4.3079 3.5194 54.6886 7.3320 9.4553 21.3488 96.2303 0.9519 27.8387 41.4338 17.4711 23.0061 9.4834 89.0203 68.0171 0.1512 107.5688 214.3620 284.4099 12.5677 26.8093 52.0636 127.5062 137.4153 4.2273 20.2459 45.4890 15.6939 66.8406 109.2070 470.8934 312.1756 127.5843 227.3364 40.6764 23.4406 13.8371 0.0347 0.1079 182.3248 89.1251
temp: 298.150 k
press: 1.00000 atm
elementType: 17 17 8 8 7 7 7 6 6 6 6 6 6 6 6 6 1 1 1 1 1 1 1
symmnumber: 1
zpe: 406846.4 jmol-1
zpe.correction: 0.154960 hartree
zpe.thermalcorrener: 0.169544 hartree
zpe.thermalcorrenthalpy: 0.170488 hartree
zpe.thermalcorrgfe: 0.111686 hartree
zpe.sumelectzpe: -1580.861972 hartree
zpe.sumelectthermal: -1580.847387 hartree
zpe.sumelectthermalent: -1580.846443 hartree
zpe.sumelectthermalfe: -1580.905245 hartree
dipole: 6.8225 0.9631 -0.0002
dipole: 6.8901
quadrupole: -89.0652 -105.6722 -107.3799
quadrupole: 1.0719 0.0026 -0.0008
quadrupole: 11.6406 -4.9664 -6.6741 1.0719 0.0026 -0.0008
hfenergy: -1581.0169314 hartree
pointgroup: C01 [X(C9H7Cl2N3O2)]
dipole: 2.6894141 0.339624 -0.0000764 debye
dipolederiv: -0.5316462 0.2928639 -0.0000529 0.4384894 -0.3520598 0.0000594 -0.0000775 0.0000579 -0.0371346 -0.7186621 -0.2081895 0.00006 -0.2861706 -0.161132 0.0000326 0.0000842 0.0000323 -0.0387676 -2.2033037 -0.0729536 -0.0002565 0.3020387 -0.4610124 -0.0000023 -0.0007893 -0.0000181 -0.3166783 -0.8074134 0.0628907 -0.0000715 -0.3111355 -0.9566565 0.0002226 -0.0002131 -0.0001278 -0.3445982 -0.8294624 0.0712751 -0.0000082 -0.0496365 -0.545041 0.0000711 0.0000423 0.0000757 -0.2493568 -1.0424188 -0.0499992 0.0000103 -0.1918014 -0.407144 0.0000369 0.0001482 0.000038 -0.2756952 -2.2151127 -0.2426179 -0.0001329 -0.690595 -0.5401886 -0.0000783 -0.0000272 -0.0000099 -0.3275907 0.4315736 -0.0289609 -0.0000269 0.421375 -0.0918505 0.0000284 -0.0001061 0.0000421 0.0662589 0.5060925 -0.1105829 0.0000069 -0.4359075 0.0752995 -0.0000115 0.000056 -0.0000259 -0.0021537 1.8063043 0.0639586 0.0000218 -0.0604475 0.689368 -0.0001479 -0.0000616 -0.0001123 0.1738486 0.0007176 0.0516611 -0.0000038 -0.0100571 -0.0909532 -0.0000131 -0.0000016 -0.0000059 -0.1249613 -0.0959061 -0.0578618 0.0000196 -0.0307593 0.0008283 -0.0000164 -0.0000032 -0.000018 -0.0934074 0.3351569 -0.5400901 0.000097 -0.7392887 0.5018635 -0.0001128 0.000143 -0.0001038 -0.0644907 0.8186298 0.4847303 -0.000131 0.6798935 0.1003535 -0.0000418 -0.0001694 -0.0000508 -0.0707978 2.8843637 0.1684019 0.0003071 0.6917294 1.3752675 -0.0002232 0.0007493 0.0000412 0.3284667 0.8799714 0.1294972 0.0001173 0.3831082 0.2884624 0.0000981 0.0001524 0.000039 0.2817748 0.454453 0.0081429 0.0000152 0.1144459 0.2342869 0.000014 0.0000226 0.0000114 0.3500327 0.0692901 -0.0265759 0.0000091 -0.0091241 -0.0077742 0.0000433 0.0000064 0.0000414 0.1865406 0.0935266 0.0001778 0.0000029 -0.022013 0.0120749 0.000035 0.0000038 0.0000342 0.1735594 0.2165094 -0.0533043 0.0000156 -0.0521686 0.2575535 0.0000275 0.0000451 0.0000319 0.355928 0.0164017 -0.0004588 -0.0408437 -0.1258897 0.023643 0.0889193 0.0128352 0.0912841 -0.0497722 -0.0854128 0.0583818 -0.0000639 0.1097264 0.0311781 0.0000381 -0.0000887 0.0000262 0.1287278 0.0163476 -0.0003861 0.0409085 -0.1258117 0.0236332 -0.088979 -0.0127505 -0.0912831 -0.0497332 unknown
polarizability: 275.8901433|-2.5559186|135.8481369|0.0045778|-0.0135285|59.4967871 unknown
InChI: InChI=1S/C9H7Cl2N3O2/c1-16-9(15)14-8-12-6-2-4(10)5(11)3-7(6)13-8/h2-3,12,14H,1H3
charge 0 multiplicity 1
23 atoms
Cl -4.530279 2.063098 -0.000432
Cl -5.069782 -1.159673 0.000276
O  4.754391 -0.450775 0.000315
O  3.259177 1.369451 -0.000019
N  0.615144 0.656931 -0.000309
N  0.2352 -1.610844 0.000197
N  2.52757 -0.867453 -0.000037
C  -0.779233 0.503164 -0.000221
C  -0.997551 -0.919863 0.000089
C  1.151256 -0.629102 -0.000038
C  -1.837438 1.427818 -0.000387
C  -2.312361 -1.430794 0.000241
C  -3.142469 0.894669 -0.000228
C  -3.375336 -0.508534 0.000081
C  3.491481 0.128428 -0.000194
C  5.887116 0.504924 0.000708
H  1.194839 1.501885 -0.000536
H  -1.684928 2.509875 -0.000626
H  -2.500447 -2.506722 0.000476
H  2.820024 -1.847056 0.000135
H  5.849978 1.139832 -0.899812
H  6.783136 -0.130253 0.001063
H  5.849313 1.139894 0.901158
