program: Gaussian 09
title: 000022994
version: EM64L-G09RevD.01
frameworkgroup: C1[X(C10H15N5O2S)]
method: RPBEPBE
basis: SDD
operation: Freq
keyword: #p
keyword: freq=noraman
keyword: PBEPBE/SDD
title: #p freq=noraman PBEPBE/SDD
converged: YES YES NO NO
title: Mulliken charges:
elementType: S O O N N N N N C C C C C C C C C C H H H H H H H H H H H H H H H
charge: 0.230390 -0.287949 -0.270247 -0.154713 -0.164215 -0.219744 -0.058443 -0.554267 0.116839 0.101799 0.153672 -0.163057 0.206440 -0.644949 -0.618340 -0.600919 -0.603965 -0.342813 0.246598 0.300429 0.246780 0.274440 0.243224 0.243281 0.268794 0.249604 0.249762 0.281840 0.241309 0.222668 0.253564 0.279191 0.272997
chargesum: 0.00000
title: Mulliken charges with hydrogens summed into heavy atoms:
elementType: S O O N N N N N C C C C C C C C C C
charge: 0.230390 -0.287949 -0.270247 -0.154713 -0.164215 -0.219744 -0.058443 -0.002080 0.116839 0.101799 0.153672 -0.163057 0.206440 0.148858 0.142605 0.167241 -0.080815 0.133419
polarizability: 2.52417850e+02 -3.08693082e+00 1.90484773e+02 7.11589405e+00 -3.03419607e+00 9.24253894e+01
1716.lowfreq: -5.3898 -0.0018 -0.0005 -0.0002 4.3657 7.5726 22.7381 44.0882 69.6178
frequency: 22.4958 44.0849 69.6147 81.5407 93.3650 107.6064 110.9518 121.8935 127.3248 129.3698 136.9581 197.7434 216.6235 227.0910 236.2113 242.4453 285.4220 302.0864 305.9606 340.9138 361.6337 368.7722 377.0317 390.0609 424.5258 472.2783 482.1790 501.5674 584.7213 629.5457 652.7126 664.8751 672.0123 702.7501 729.8551 731.6792 737.6428 779.7819 925.9991 928.0555 958.6612 1013.5680 1022.4343 1050.0512 1093.3921 1097.7277 1115.3865 1128.4366 1129.9185 1132.6441 1191.2367 1209.0801 1228.7489 1241.0739 1264.4922 1269.5107 1298.2162 1321.4483 1330.8442 1342.3932 1347.9364 1388.3687 1414.1276 1419.3988 1427.5490 1455.5038 1463.3607 1471.0522 1474.9635 1478.1553 1479.7513 1482.3320 1486.7923 1500.4695 1571.2918 1614.3701 1637.8539 1647.1020 2992.4410 3004.1611 3011.9167 3014.3756 3029.5194 3077.8223 3083.8166 3092.6272 3103.7560 3117.5839 3118.0553 3136.8207 3138.1413 3491.4394 3623.5718
redmass: 5.2389 4.7742 4.4282 2.3171 1.7627 1.1475 1.6345 3.0588 1.1844 3.8842 2.1792 4.0318 5.3059 3.5197 5.0614 3.2759 3.0750 1.0618 6.0972 4.3044 4.4188 7.9927 5.3413 8.4615 7.0916 5.1435 1.6079 7.4392 5.7627 10.1967 5.9940 8.1563 11.5100 11.2683 5.0863 1.2115 10.1850 5.6251 1.3287 2.8939 5.5074 5.1826 3.1082 3.1441 1.1796 4.3223 1.9730 1.3011 1.3030 1.2980 3.1838 5.6698 2.6745 1.2269 5.5998 1.3057 6.8598 2.5379 1.6690 2.2456 1.6987 2.8924 1.2913 1.0971 1.2590 1.8165 1.0853 1.3299 1.0480 1.0777 1.0475 1.1079 1.0473 2.1697 7.8813 10.6413 1.0962 9.5758 1.0334 1.0337 1.0328 1.0612 1.0584 1.1031 1.1025 1.1025 1.1022 1.1026 1.1085 1.1008 1.1023 1.0443 1.0999
irintensity: 0.2794 0.1538 0.2523 1.6839 2.7647 0.7203 1.3051 1.7129 0.2748 0.0849 13.7686 4.8405 5.0238 10.5998 1.1054 1.6044 4.2090 43.8184 0.3426 10.7365 7.4734 0.3957 7.9903 33.8256 3.1460 31.7850 347.7115 17.5859 3.7043 1.9065 68.1150 5.4838 0.2349 6.2552 9.9217 15.4552 14.4676 0.4035 0.2971 7.1146 37.7316 13.2652 71.6053 9.9586 0.9794 33.2437 51.6684 0.5761 0.1818 0.1720 42.7250 28.0526 2.9327 25.7305 41.2150 0.0366 20.2524 119.4791 79.7576 79.6866 40.1991 32.1085 18.8778 26.2150 39.0148 144.4805 8.0331 101.3364 18.6170 2.7058 19.8691 37.7558 28.5697 150.9358 6.4883 569.7668 63.3170 497.2226 35.1396 34.4577 31.7534 17.8356 29.8096 12.6357 15.7401 19.8627 17.7738 1.2722 11.3675 0.4141 0.8192 6.9487 3.1409
temp: 298.150 k
press: 1.00000 atm
elementType: 16 8 8 7 7 7 7 7 6 6 6 6 6 6 6 6 6 6 1 1 1 1 1 1 1 1 1 1 1 1 1 1 1
symmnumber: 1
zpe: 674413.1 jmol-1
zpe.correction: 0.256870 hartree
zpe.thermalcorrener: 0.276312 hartree
zpe.thermalcorrenthalpy: 0.277256 hartree
zpe.thermalcorrgfe: 0.208304 hartree
zpe.sumelectzpe: -1211.003950 hartree
zpe.sumelectthermal: -1210.984509 hartree
zpe.sumelectthermalent: -1210.983564 hartree
zpe.sumelectthermalfe: -1211.052517 hartree
dipole: -4.7487 -0.1323 -1.2042
dipole: 4.9008
quadrupole: -110.8413 -115.1820 -116.2078
quadrupole: -3.8909 5.2302 -3.5294
quadrupole: 3.2358 -1.1050 -2.1308 -3.8909 5.2302 -3.5294
hfenergy: -1211.2608209 hartree
pointgroup: C01 [X(C10H15N5O2S1)]
dipole: 1.8480036 -0.0824725 0.5437591 debye
polarizability: 251.9945291|1.2581217|189.4660661|11.9677224|-9.5150368|93.8674172 unknown
InChI: InChI=1S/C10H15N5O2S/c1-13-6-7(12-9(13)18-5-4-11)14(2)10(17)15(3)8(6)16/h4-5,11H2,1-3H3
charge 0 multiplicity 1
33 atoms
S  3.18249 -1.675976 0.696336
O  -2.632213 -2.284833 -0.116456
O  -3.042481 2.411939 -0.311455
N  0.428279 -1.767618 0.293226
N  -0.889709 1.534968 0.014015
N  -2.806656 0.081289 -0.207459
N  1.265515 0.366096 0.346837
N  5.25291 1.704958 -0.769058
C  -0.662057 -0.889872 0.11981
C  -0.107908 0.399307 0.1577
C  -2.063093 -1.146977 -0.068889
C  1.552229 -0.965891 0.425995
C  -2.288134 1.406197 -0.176247
C  0.37421 -3.238786 0.333494
C  -0.280875 2.877356 0.05495
C  -4.270786 -0.020124 -0.407082
C  4.205137 -0.060624 0.670643
C  4.471032 0.463667 -0.762177
H  0.714412 -3.608689 1.316617
H  -0.670011 -3.544125 0.166039
H  1.018562 -3.664785 -0.455207
H  -1.090777 3.611562 -0.064386
H  0.453252 2.986905 -0.761284
H  0.233715 3.030454 1.018466
H  -4.528187 -1.089273 -0.39888
H  -4.554689 0.438946 -1.36818
H  -4.799583 0.513006 0.39972
H  3.635754 0.673057 1.264154
H  5.138602 -0.331441 1.194972
H  5.003073 -0.30548 -1.350962
H  3.50273 0.647617 -1.25828
H  4.775439 2.535348 -0.412972
H  6.227417 1.630823 -0.470201
