program: Gaussian 09
title: 000269204
version: EM64L-G09RevD.01
frameworkgroup: C1[X(C10H8IN)]
method: RPBEPBE
basis: SDD
operation: Freq
keyword: #p
keyword: freq=noraman
keyword: PBEPBE/SDD
title: #p freq=noraman PBEPBE/SDD
converged: NO YES NO NO
title: Mulliken charges:
elementType: I N C C C C C C C C C C H H H H H H H H
charge: 0.037132 -0.021180 0.281599 0.464354 -0.047261 -0.362427 -0.299369 -0.960561 -0.302246 -0.254716 -0.221124 -0.369488 0.244902 0.231393 0.303685 0.300816 0.263972 0.232330 0.235178 0.243011
chargesum: 0.00000
title: Mulliken charges with hydrogens summed into heavy atoms:
elementType: I N C C C C C C C C C C
charge: 0.037132 -0.021180 0.281599 0.464354 -0.047261 -0.117525 -0.067976 -0.356060 -0.038275 -0.022386 0.014054 -0.126476
polarizability: 1.81023574e+02 -4.60322490e+00 1.60692680e+02 -4.99295601e+00 8.49188919e-01 7.49903743e+01
1716.lowfreq: -7.9547 -6.2259 -0.0005 -0.0002 0.0004 10.7132 44.6738 63.2344 129.9617
frequency: 44.6234 63.2097 129.9588 177.4425 237.5401 279.6874 399.0368 433.8387 465.2158 476.1217 489.1941 510.4667 559.2876 603.7614 661.5108 697.7154 772.3192 799.0465 806.1463 831.3708 859.5117 861.5479 884.6744 962.2769 969.0882 999.4544 1013.8420 1030.4067 1077.8589 1109.9103 1144.0561 1177.0360 1184.2817 1221.0949 1254.6474 1272.0147 1338.0115 1380.2821 1386.8326 1431.1356 1452.7720 1460.0729 1509.5447 1550.0879 1580.0715 1621.5703 3074.4680 3124.8842 3131.8353 3144.1378 3149.0727 3156.8942 3159.8472 3174.0212
redmass: 6.2599 6.6745 5.0880 4.2635 5.8031 2.8562 4.1907 3.2398 3.1556 3.9094 6.7741 6.6365 6.8208 3.6611 3.3986 4.9575 1.4322 2.7302 4.7179 1.8300 2.6049 1.4437 1.8568 1.4239 1.3927 1.3352 3.0977 1.9295 2.9708 1.2117 1.4036 1.1776 1.1569 2.0339 1.9610 1.8335 3.9969 2.3721 2.4180 2.7948 2.6881 1.1562 3.5878 6.7085 6.6439 6.3807 1.0572 1.0884 1.0856 1.0903 1.0968 1.1077 1.0975 1.0995
irintensity: 0.6417 0.5421 0.8293 5.6142 2.0731 1.1194 4.9931 5.2906 8.9862 11.0952 25.4603 0.7611 21.3806 1.7002 0.2768 3.9448 73.3241 10.5289 2.8273 9.0402 8.5293 19.7558 6.5753 0.0399 2.2449 0.3401 3.4577 3.6986 1.1509 8.1713 10.5314 1.4209 41.0754 2.3613 20.5709 2.5130 2.2569 7.4467 1.3124 9.9516 3.9626 13.1108 19.5222 9.8174 9.6397 1.1267 9.4735 14.4422 0.2632 10.0911 27.8947 0.8735 18.0827 18.9093
temp: 298.150 k
press: 1.00000 atm
elementType: 53 7 6 6 6 6 6 6 6 6 6 6 1 1 1 1 1 1 1 1
symmnumber: 1
zpe: 396470.8 jmol-1
zpe.correction: 0.151008 hartree
zpe.thermalcorrener: 0.160727 hartree
zpe.thermalcorrenthalpy: 0.161671 hartree
zpe.thermalcorrgfe: 0.113355 hartree
zpe.sumelectzpe: -451.297596 hartree
zpe.sumelectthermal: -451.287877 hartree
zpe.sumelectthermalent: -451.286932 hartree
zpe.sumelectthermalfe: -451.335249 hartree
dipole: -0.1520 -0.5537 1.8559
dipole: 1.9427
quadrupole: -89.9017 -74.7173 -85.2512
quadrupole: -8.2416 -1.4650 1.5467
quadrupole: -6.6116 8.5728 -1.9612 -8.2416 -1.4650 1.5467
hfenergy: -451.4486034 hartree
pointgroup: C01 [X(C10H8I1N1)]
dipole: 0.0206389 -0.3196142 -0.6939807 debye
dipolederiv: -0.3039165 0.194127 -0.0774412 0.3078947 -0.3321821 0.1129032 -0.3094138 0.2705984 -0.2456211 -0.3246226 0.0285843 -0.0038494 0.125754 -0.316123 0.0207888 0.0049887 0.0054714 -0.2493505 -0.2062069 -0.0051781 0.0449966 0.3447745 -0.1295642 -0.0064289 0.0745648 -0.018656 0.0635767 0.1754377 0.0539701 0.0004217 0.0825303 0.0790593 0.0520581 0.0352074 -0.0172589 -0.1262998 0.2540971 0.2027466 0.024705 -0.0665284 0.0072663 0.0030636 -0.0218922 -0.054109 0.0624215 -0.0948889 -0.0486706 -0.028033 -0.0984964 0.0583889 0.0171827 -0.0089892 0.0220357 -0.1517543 -0.0047763 0.1593427 -0.0490587 -0.0667824 -0.3395828 -0.0118848 -0.0303226 -0.036429 -0.0773991 0.3783117 -0.3047548 0.1828201 -0.468387 0.42875 -0.2944566 0.3289164 -0.3310442 0.3810988 0.0171752 -0.0914896 -0.0341178 -0.12736 0.0419353 0.0376603 -0.0448818 0.0399848 -0.1321862 -0.0701933 -0.0109922 -0.0134331 0.0150116 0.1841249 0.0348778 -0.0205588 0.0369592 -0.1369438 0.1733293 0.0146619 -0.0487293 -0.0162598 -0.1224618 0.0024171 -0.0553691 0.0032482 -0.1429977 0.0315869 -0.1101539 -0.0419576 0.0197201 0.4806687 0.0300866 0.0241084 0.066129 -0.0306221 0.0295633 0.0980697 0.0466862 0.0646804 -0.0165264 -0.0222785 0.0185714 -0.0255157 0.1338797 -0.1013538 -0.0584073 0.0314574 -0.0285212 0.0935944 -0.0141877 0.0227805 0.0153928 0.1281708 -0.0247404 0.0324871 0.005452 -0.0602313 0.007267 0.1095823 -0.0039153 0.0914334 -0.0100533 0.0496232 -0.0261454 -0.1007401 0.0707372 -0.0196019 0.0022889 -0.0987421 0.0046077 -0.0487629 0.0352118 0.0414057 0.0236111 0.0982666 0.0164504 -0.0325506 0.0339771 -0.0272666 0.1498401 0.058345 -0.0602194 0.0028838 -0.0798768 -0.0905375 -0.0250738 0.0071002 -0.0206046 0.1534807 -0.120159 -0.0389527 0.0327306 -0.0496935 0.0852687 -0.0030436 0.0381723 -0.0027566 0.1539505 0.0481766 -0.070431 0.0015956 -0.0672326 -0.1161943 -0.0130051 0.0056977 -0.02222 0.1255719 unknown
polarizability: 180.1295526|-5.3545422|160.1072388|6.4993171|-10.919358|76.469837 unknown
InChI: InChI=1S/C10H8IN/c11-7-8-5-6-12-10-4-2-1-3-9(8)10/h1-6H,7H2
charge 0 multiplicity 1
20 atoms
I  3.143161 -2.094694 0.995859
N  -0.596412 2.135733 0.238339
C  -0.060713 -0.266853 -0.199584
C  1.330365 0.082081 -0.389431
C  -0.989333 0.80681 0.107362
C  -0.567028 -1.602886 -0.294229
C  1.698047 1.428702 -0.245612
C  2.362872 -0.932027 -0.770309
C  -2.377746 0.510013 0.287974
C  -1.927995 -1.864525 -0.108413
C  -2.84171 -0.802756 0.180321
C  0.710781 2.412259 0.068286
H  0.116733 -2.434954 -0.492208
H  2.741866 1.736597 -0.37236
H  3.271126 -0.470411 -1.180422
H  1.992199 -1.720167 -1.439599
H  -3.0446 1.347689 0.513686
H  -2.2993 -2.89278 -0.179093
H  -3.904921 -1.024969 0.321304
H  1.001907 3.463738 0.176429
