program: Gaussian 09
title: 000269202
version: EM64L-G09RevD.01
frameworkgroup: C1[X(C11H11NO3)]
method: RPBEPBE
basis: SDD
operation: Freq
keyword: #p
keyword: freq=noraman
keyword: PBEPBE/SDD
title: #p freq=noraman PBEPBE/SDD
converged: YES YES NO NO
title: Mulliken charges:
elementType: O O O N C C C C C C C C C C C H H H H H H H H H H H
charge: -0.317376 -0.283714 -0.287784 -0.391344 0.132617 0.114356 0.212024 0.202562 0.141482 -0.323927 -0.386396 -0.219562 -0.294408 -0.525700 -0.527769 0.350202 0.244707 0.255237 0.241541 0.250097 0.227684 0.228799 0.243084 0.225455 0.197348 0.290783
chargesum: 0.00000
title: Mulliken charges with hydrogens summed into heavy atoms:
elementType: O O O N C C C C C C C C C C C
charge: -0.317376 -0.283714 -0.287784 -0.041142 0.132617 0.114356 0.212024 0.202562 0.141482 -0.079220 -0.131158 0.021980 -0.044311 0.173866 0.185818
polarizability: 1.95029409e+02 -4.17750989e-01 1.63908799e+02 -2.05619580e+00 2.79825507e+00 6.61539065e+01
1716.lowfreq: -11.3595 -0.0004 0.0007 0.0007 2.8709 8.2960 37.4680 70.8208 97.9277
frequency: 37.3848 70.8126 97.9238 123.3671 157.4231 171.7842 185.9882 229.1460 238.1057 251.6658 271.5290 341.0580 374.1337 415.7056 438.6127 465.0309 477.2990 493.5480 524.4675 597.0476 628.2345 643.7479 673.0704 684.6724 703.7975 773.9087 787.3321 815.0577 832.8007 878.6597 923.4900 927.9008 946.4519 1018.8161 1034.2490 1081.9194 1106.3518 1118.7875 1127.8935 1149.7663 1156.6195 1179.5211 1215.3008 1227.5028 1263.6382 1281.9310 1363.9701 1384.9520 1404.4045 1429.0095 1433.9531 1446.7042 1453.0083 1466.1127 1476.9849 1496.8263 1503.3153 1546.6632 1574.5205 1616.2899 1634.3312 2965.1117 2967.4841 3057.7847 3078.6625 3118.3718 3128.3520 3157.6027 3163.3968 3178.3798 3193.6758 3534.5678
redmass: 3.3190 3.1665 3.0660 2.0233 2.5487 2.9616 3.0605 1.2680 5.8949 3.8892 3.8904 5.6586 6.6966 5.6018 6.1001 4.7369 5.2262 4.0470 7.1162 5.2084 5.3947 3.5311 1.8222 5.4505 1.8940 3.1395 5.2235 1.4864 2.2194 6.7126 1.6628 3.7176 1.2901 6.8279 5.5685 1.8898 1.2401 1.2559 2.2106 1.5338 1.3636 1.4896 1.9016 1.8000 3.2717 2.6241 4.8823 1.8819 1.5533 1.4896 2.9911 1.1768 1.5011 1.0500 1.0975 1.0970 2.9177 6.5202 5.8258 6.0249 6.1825 1.0328 1.0324 1.1044 1.1004 1.1037 1.1003 1.0877 1.0894 1.0961 1.0985 1.0779
irintensity: 3.0167 4.1315 1.3159 9.0711 1.9407 2.2470 10.5138 3.0527 0.5560 5.7231 2.3787 1.5926 1.8200 11.6302 2.8776 4.4630 5.0759 5.8981 7.6909 4.6266 8.2136 1.5701 44.9789 25.6633 67.0979 20.7069 7.7815 22.9097 60.3785 3.4172 4.0451 13.1777 0.9001 47.1206 169.5638 6.5893 26.0782 0.1031 36.5711 0.3531 14.6426 7.6737 26.7412 157.4663 31.8792 1.4734 3.6301 4.0804 8.9148 126.5391 6.4095 5.5542 68.0737 14.3829 22.1346 59.8705 160.3325 233.8201 40.4728 58.3981 147.9042 122.6661 60.9629 42.2922 27.9455 13.6753 19.8568 9.2544 7.3880 6.3444 8.2959 117.0519
temp: 298.150 k
press: 1.00000 atm
elementType: 8 8 8 7 6 6 6 6 6 6 6 6 6 6 6 1 1 1 1 1 1 1 1 1 1 1
symmnumber: 1
zpe: 525865.8 jmol-1
zpe.correction: 0.200292 hartree
zpe.thermalcorrener: 0.213864 hartree
zpe.thermalcorrenthalpy: 0.214808 hartree
zpe.thermalcorrgfe: 0.159977 hartree
zpe.sumelectzpe: -705.083603 hartree
zpe.sumelectthermal: -705.070031 hartree
zpe.sumelectthermalent: -705.069087 hartree
zpe.sumelectthermalfe: -705.123918 hartree
dipole: -7.1714 0.3634 2.0329
dipole: 7.4628
quadrupole: -80.1227 -74.4790 -90.8632
quadrupole: -1.4690 5.7805 -1.0949
quadrupole: 1.6989 7.3426 -9.0415 -1.4690 5.7805 -1.0949
hfenergy: -705.2838951 hartree
pointgroup: C01 [X(C11H11N1O3)]
dipole: 2.7786322 0.1470452 -0.9371366 debye
dipolederiv: -1.7851548 0.0651986 0.1227836 -0.1717429 -0.3752244 0.0113006 0.1559817 0.0029518 -0.2995393 -1.4339224 -0.4036692 -0.1881037 -0.2343712 -0.3911592 -0.0572791 0.0624442 0.0516216 -0.356464 -1.2392374 -0.0272845 0.1271003 -0.1216871 -0.4855286 -0.0069652 0.1188318 -0.0751383 -0.4008154 -0.7577239 -0.0050333 0.0728675 0.3176435 -0.9406426 -0.055522 0.0896335 0.01593 -0.2542713 -0.0929424 -0.0905805 0.0065815 0.1942827 0.769114 -0.0204208 0.0137451 -0.0167352 0.0646965 -0.4147462 0.1629383 0.0461262 0.1725092 -0.2147114 -0.0502049 0.1277618 0.0050477 -0.0432203 1.2946938 0.2942356 -0.1215871 0.3866744 -0.2715275 -0.0479431 -0.1479199 -0.0406419 0.0414061 1.0844607 0.5309973 0.0307492 0.2118203 0.2343449 0.1147889 -0.2221808 -0.05616 0.0045908 1.285945 -0.073006 -0.1910251 0.2493283 0.7280337 -0.0288323 -0.2100097 0.0193836 0.2003952 0.0425293 0.1859442 -0.0139104 -0.1117667 0.1272558 0.0135849 -0.0083982 -0.0181547 -0.1708202 -0.3722485 -0.2709382 -0.0371228 0.2676725 0.0296457 -0.0380247 -0.0722331 -0.0306486 -0.1718348 0.9183795 -0.2527711 -0.1475023 -0.3338004 0.3797903 0.0509107 -0.1538036 0.0289238 -0.0340124 -0.4842785 -0.0496123 0.0257633 -0.5324307 -0.2795466 0.0775545 0.0231289 0.0196516 -0.2441827 0.8342745 -0.1393799 -0.0392209 -0.4498254 0.319078 0.0380982 -0.0377698 0.0147253 0.3251493 0.689221 0.1559979 0.1665051 -0.1377723 0.0965316 -0.0280967 0.2565572 0.0795625 0.4108581 0.3113503 -0.0026875 0.0018154 0.0023277 0.2427362 -0.0039469 -0.0053079 0.0012682 0.3219632 -0.0231437 0.0990706 0.0122428 0.1104057 0.0362008 -0.0075599 0.0240473 0.0009071 0.1632684 0.0759347 -0.0431718 0.0102515 -0.0331101 -0.0514605 0.0026415 0.003786 -0.0047432 0.1618643 0.0645904 -0.0882309 0.0139194 -0.0521986 -0.0655252 0.0049752 0.0150974 0.0082487 0.1688823 0.0439939 0.0833106 0.0230176 0.0437975 -0.008734 -0.0085389 0.0318214 -0.0148641 0.1671118 0.0216566 -0.0278396 -0.0502906 0.1459837 -0.025897 -0.1249239 0.019122 -0.1025163 -0.0735555 0.0257584 -0.0055135 0.0312787 0.164719 -0.0129803 0.0931041 -0.0473433 0.1012253 -0.0868005 -0.1028067 -0.0562922 0.0229104 -0.1245585 0.0287276 0.014187 0.0261237 0.0076282 0.1226909 -0.0849495 -0.1219829 -0.0037375 -0.1776879 -0.0216 0.025161 0.0043542 0.0420089 0.0772507 -0.0127512 0.0240724 0.0940463 0.0174318 0.0714785 -0.0358433 -0.0995843 -0.0833227 -0.1879717 0.1111166 0.0562278 -0.0154585 0.1963555 0.0816003 0.0677951 0.0321144 0.0438406 0.0933605 unknown
polarizability: 194.4711383|0.2154045|163.8504166|-8.7585169|3.5751296|66.7705593 unknown
InChI: InChI=1S/C11H11NO3/c1-14-8-3-4-9(15-2)11-10(8)7(13)5-6-12-11/h3-6,12H,1-2H3
charge 0 multiplicity 1
26 atoms
O  3.043682 0.156163 -0.425294
O  -2.195032 -1.86529 0.158713
O  -2.92572 1.003652 0.411291
N  1.077752 1.881263 -0.234305
C  0.707366 0.534015 -0.189766
C  -0.666054 0.146777 -0.038148
C  1.763492 -0.422121 -0.279921
C  -0.937845 -1.272667 -0.014222
C  -1.685789 1.226531 0.169501
C  1.47331 -1.78953 -0.210513
C  0.123746 -2.198004 -0.0860
C  0.151523 2.892593 -0.095999
C  -1.180864 2.601199 0.100485
C  4.18584 -0.755898 -0.506171
C  -3.26478 -1.588007 -0.825611
H  2.076308 2.069625 -0.351511
H  2.263954 -2.543242 -0.26522
H  -0.134951 -3.259793 -0.046481
H  0.536216 3.914943 -0.143798
H  -1.911595 3.403119 0.228264
H  4.101617 -1.418962 -1.388269
H  4.270995 -1.365542 0.413585
H  5.070088 -0.110067 -0.608573
H  -4.053545 -2.318289 -0.587126
H  -2.88942 -1.760633 -1.853392
H  -3.634894 -0.558431 -0.695614
