program: Gaussian 09
title: 000269193
version: EM64L-G09RevD.01
frameworkgroup: C1[X(C14H17NO2)]
method: RPBEPBE
basis: SDD
operation: Freq
keyword: #p
keyword: freq=noraman
keyword: PBEPBE/SDD
title: #p freq=noraman PBEPBE/SDD
converged: YES YES NO NO
title: Mulliken charges:
elementType: O O N C C C C C C C C C C C C C C H H H H H H H H H H H H H H H H H
charge: -0.291840 -0.290883 -0.213667 0.222434 -0.444643 0.213782 0.404374 0.120606 -0.236105 -0.486964 -0.312709 -0.378496 -0.814546 -0.259230 -0.274789 -0.194254 -0.681166 0.262583 0.237110 0.233635 0.197219 0.250512 0.283995 0.241678 0.237743 0.235706 0.236037 0.228991 0.228926 0.187798 0.194357 0.205692 0.231898 0.224219
chargesum: 0.00000
title: Mulliken charges with hydrogens summed into heavy atoms:
elementType: O O N C C C C C C C C C C C C C C
charge: -0.291840 -0.290883 -0.213667 0.222434 0.055050 0.213782 0.404374 0.120606 0.194749 -0.236452 -0.028714 -0.136819 -0.105061 -0.030239 -0.045863 0.187900 -0.019358
polarizability: 1.85540026e+02 5.18210829e+00 2.15842981e+02 2.10663673e+01 -6.30813753e+00 1.03801411e+02
1716.lowfreq: -5.6172 -0.0006 -0.0004 0.0004 5.1648 10.8722 23.2933 44.3495 59.0921
frequency: 23.2774 44.3443 59.0750 72.2643 108.4620 130.7928 143.1244 157.8587 186.0141 219.8132 234.9711 242.4120 278.3782 308.4357 333.5946 392.3938 411.3811 421.5112 431.3084 458.2276 504.2267 511.2921 549.9539 581.4488 591.5015 651.3827 691.1879 697.6181 759.1829 764.2627 777.0294 784.6609 814.8002 859.2131 878.9767 887.9969 933.6460 945.0241 966.9882 981.7026 1003.2769 1030.5524 1045.2088 1046.4388 1062.7638 1074.8286 1091.0611 1102.0513 1126.4480 1141.2588 1161.3682 1182.3982 1197.3332 1223.3482 1244.9544 1250.9244 1292.5508 1300.1060 1330.0347 1345.2543 1373.9236 1383.0172 1389.3179 1396.8041 1402.7474 1406.9357 1447.0466 1451.0127 1459.9897 1468.8192 1469.2426 1472.7220 1481.1549 1493.7785 1495.4276 1555.2632 1564.5530 1619.0668 1645.5228 2920.2828 2933.1521 2970.7155 2979.1646 2993.1152 3000.3759 3034.9986 3056.1417 3091.3289 3097.0193 3097.8167 3099.5025 3132.8944 3145.8508 3165.6635 3168.0334 3187.2265
redmass: 3.6496 3.9813 2.0094 3.6567 4.7150 3.7178 3.1945 4.0773 1.3205 1.9529 1.7712 1.8234 3.2016 3.8383 5.2409 4.2094 2.7122 3.4196 3.6080 4.3502 3.6209 4.5284 3.1994 3.9759 3.3276 6.2133 4.1319 4.0385 1.9784 1.9449 3.8607 2.5965 1.0885 1.5008 1.4413 2.6707 3.3848 1.3778 2.0863 1.3233 1.8505 3.3107 1.9408 2.1282 2.9294 2.9277 2.3187 3.3965 2.1338 1.5257 1.5486 1.2826 1.6438 1.5060 1.4276 1.1645 1.4345 2.6288 1.4335 1.4518 2.8485 1.3644 1.2540 1.3038 1.4426 4.7846 2.1448 1.2587 1.0415 1.0465 1.0924 1.1153 1.0506 1.3445 1.8696 6.1079 6.4965 6.1653 7.3442 1.0561 1.0602 1.1062 1.0378 1.0357 1.0990 1.0619 1.0971 1.0991 1.1030 1.0984 1.1011 1.0856 1.0905 1.0980 1.0924 1.0950
irintensity: 0.0386 2.3171 2.4202 2.7720 3.7350 3.6979 3.1821 1.3430 0.1968 2.5097 1.2784 1.0751 0.0927 0.9420 5.5383 2.8871 9.5312 5.8786 3.7524 8.1060 5.0736 4.4789 0.6504 4.9511 0.1336 6.2142 6.8035 2.4311 52.0732 42.6159 1.5022 1.6702 4.1449 6.0813 23.0192 14.9876 8.4102 5.7311 15.3318 0.5641 6.3785 17.3903 7.4321 1.6666 79.8595 72.7745 3.9457 7.2230 14.7742 5.3373 1.5495 1.5486 14.5680 7.1652 9.5773 1.5156 2.6752 48.9632 31.0424 14.4099 39.1913 1.3247 22.6694 21.9797 4.9152 9.2801 80.8521 16.3216 11.5898 16.4669 10.8635 8.2846 3.4145 10.1616 15.2439 96.8084 128.9431 4.3015 256.5614 49.0116 104.4328 57.2202 20.8339 20.5412 22.2054 36.1245 15.9696 37.8863 4.0098 20.6023 38.4722 2.2918 16.4048 25.7276 4.5198 4.5794
temp: 298.150 k
press: 1.00000 atm
elementType: 8 8 7 6 6 6 6 6 6 6 6 6 6 6 6 6 6 1 1 1 1 1 1 1 1 1 1 1 1 1 1 1 1 1
symmnumber: 1
zpe: 736250.8 jmol-1
zpe.correction: 0.280423 hartree
zpe.thermalcorrener: 0.296709 hartree
zpe.thermalcorrenthalpy: 0.297653 hartree
zpe.thermalcorrgfe: 0.235718 hartree
zpe.sumelectzpe: -747.643886 hartree
zpe.sumelectthermal: -747.627600 hartree
zpe.sumelectthermalent: -747.626656 hartree
zpe.sumelectthermalfe: -747.688591 hartree
dipole: -0.5190 3.0803 0.6342
dipole: 3.1875
quadrupole: -80.8894 -109.9074 -99.8695
quadrupole: 4.1668 2.9641 -0.3493
quadrupole: 15.9994 -13.0187 -2.9807 4.1668 2.9641 -0.3493
hfenergy: -747.9243086 hartree
pointgroup: C01 [X(C14H17N1O2)]
dipole: -0.2260152 -1.2210141 0.1751135 debye
polarizability: 194.587961|12.5059273|207.9641352|-8.4620307|18.7875776|102.6323225 unknown
InChI: InChI=1S/C14H17NO2/c1-3-17-9-8-15-13-7-5-4-6-12(13)11(2)10-14(15)16/h4-7,10H,3,8-9H2,1-2H3
charge 0 multiplicity 1
34 atoms
O  2.828774 -0.739043 0.304602
O  0.850268 3.346117 0.146537
N  0.390752 1.110251 -0.404699
C  -0.485854 0.006162 -0.428145
C  1.765451 1.05127 -0.962505
C  -1.858705 0.183252 -0.027407
C  -2.300688 1.488198 0.456372
C  0.003925 2.390844 0.101459
C  2.854404 0.707094 0.059403
C  -1.386585 2.519799 0.520406
C  -0.040199 -1.283554 -0.839351
C  -2.743069 -0.932137 -0.100757
C  -3.73694 1.701979 0.888976
C  -0.940999 -2.358655 -0.901823
C  -2.30415 -2.188202 -0.543715
C  3.775379 -1.151415 1.35215
C  3.666686 -2.668034 1.505759
H  1.980615 2.063797 -1.344971
H  1.794776 0.336658 -1.801206
H  2.687877 1.275081 0.997983
H  3.845248 1.001445 -0.354028
H  -1.66774 3.512043 0.884768
H  1.018639 -1.454743 -1.041325
H  -3.787745 -0.800423 0.198383
H  -3.893294 2.739139 1.227084
H  -4.013525 1.02629 1.720204
H  -4.44076 1.503286 0.058828
H  -0.576569 -3.343154 -1.215596
H  -2.999648 -3.032018 -0.596643
H  4.807942 -0.852178 1.06255
H  3.523352 -0.634262 2.304233
H  4.352055 -3.025628 2.295654
H  2.636165 -2.953428 1.77904
H  3.928463 -3.17363 0.56008
