program: Gaussian 09
title: 000269185
version: EM64L-G09RevD.01
frameworkgroup: C1[X(C15H13NO)]
method: RPBEPBE
basis: SDD
operation: Freq
keyword: #p
keyword: freq=noraman
keyword: PBEPBE/SDD
title: #p freq=noraman PBEPBE/SDD
converged: YES YES NO NO
title: Mulliken charges:
elementType: O N C C C C C C C C C C C C C C C H H H H H H H H H H H H H
charge: -0.260923 -0.046197 0.183272 0.210502 -0.090892 0.421293 0.418898 -0.350079 -0.479877 -0.347531 -0.490024 -0.456819 -0.853367 0.080187 -0.286542 -0.248712 -0.512865 0.262439 0.241299 0.239548 0.250186 0.241680 0.238437 0.238995 0.239301 0.226200 0.230910 0.236190 0.228282 0.236210
chargesum: 0.00000
title: Mulliken charges with hydrogens summed into heavy atoms:
elementType: O N C C C C C C C C C C C C C C C
charge: -0.260923 -0.046197 0.183272 0.210502 -0.090892 0.421293 0.418898 -0.087640 -0.238578 -0.107983 -0.239838 -0.215139 -0.136634 0.080187 -0.060343 -0.017802 0.187817
polarizability: 2.99371568e+02 6.94868512e-01 1.84650060e+02 1.26084774e-02 -6.39540313e-02 7.54077306e+01
1716.lowfreq: -7.5455 -3.8857 -0.0004 -0.0003 0.0005 3.8962 7.6713 69.7322 105.5859
frequency: 6.8984 69.7307 105.5834 145.6771 158.5499 189.6461 216.0576 228.3993 246.0383 310.2541 326.9811 360.6491 377.2091 404.9812 414.9158 489.1895 494.7863 526.5886 548.8063 550.9546 553.1229 600.7221 617.7967 660.4691 676.4100 735.0856 759.8694 765.0264 812.5399 837.9290 844.8495 869.4409 887.2380 909.5615 956.7663 964.9194 979.5432 985.7674 994.5457 1009.3989 1045.7394 1047.5536 1056.8838 1114.2175 1118.3874 1151.1351 1152.9609 1179.2989 1188.3370 1232.9938 1262.1966 1283.2908 1302.1843 1347.7351 1362.4261 1374.5192 1395.0308 1401.7052 1422.2451 1435.6741 1448.2348 1456.5353 1466.1705 1483.6273 1489.8268 1495.9844 1530.0719 1551.9401 1589.0006 1616.6181 1631.5754 2980.0148 2997.6018 3065.0776 3085.7105 3097.0370 3121.7966 3129.2113 3135.0556 3137.8304 3160.0573 3167.0598 3170.2159 3248.6905
redmass: 3.3686 3.9097 3.1345 1.1652 3.6801 3.9104 3.7766 3.9517 4.6950 3.2569 1.3060 3.6553 6.1297 4.2314 2.8666 2.9608 5.5115 7.2119 3.5427 5.3080 4.8431 3.7053 5.5120 3.7505 5.6086 3.2041 1.3105 6.2361 2.4725 4.8990 1.7758 1.4190 1.7729 8.0200 1.3743 6.8010 2.6517 1.3381 1.3749 4.1403 1.5621 2.0626 2.2013 1.2562 1.9958 1.3471 1.4147 1.2152 1.4585 1.9505 1.7513 2.9428 2.4948 4.2747 4.1325 4.0592 4.5596 1.2240 1.9160 1.7001 1.0511 2.1513 1.0658 1.0477 1.2369 4.0212 3.4907 7.0980 6.0732 6.0738 7.1237 1.0374 1.0293 1.0983 1.0982 1.1040 1.0870 1.0889 1.0908 1.1046 1.0993 1.0925 1.0967 1.0892
irintensity: 0.0084 1.5616 5.0749 0.0899 3.6834 0.4100 0.1586 8.5686 1.4496 3.8278 6.2203 0.0047 1.8142 8.9886 1.5492 2.3146 1.0216 2.1487 0.5544 2.8415 10.5940 10.9370 8.3768 0.8495 0.9518 4.1431 58.8393 5.7278 0.7317 3.4492 50.5996 11.4944 23.2273 6.7884 3.1211 5.3717 1.6154 0.0026 0.5589 32.0139 7.1701 5.3671 52.6403 0.1638 15.2341 4.1178 17.1852 24.4713 83.2635 2.1180 22.1567 34.1789 3.0458 196.9205 28.3684 15.5475 0.0036 15.6059 1.8781 5.6988 13.0405 64.1117 35.5052 14.9169 88.8732 6.6319 7.2401 106.8209 206.0330 4.4057 7.6900 19.2328 61.7889 12.9626 28.3976 31.6518 1.5053 6.8829 21.2262 30.0533 38.7165 6.4607 12.3634 8.2413
temp: 298.150 k
press: 1.00000 atm
elementType: 8 7 6 6 6 6 6 6 6 6 6 6 6 6 6 6 6 1 1 1 1 1 1 1 1 1 1 1 1 1
symmnumber: 1
zpe: 626378.8 jmol-1
zpe.correction: 0.238575 hartree
zpe.thermalcorrener: 0.252393 hartree
zpe.thermalcorrenthalpy: 0.253337 hartree
zpe.thermalcorrgfe: 0.196650 hartree
zpe.sumelectzpe: -708.205680 hartree
zpe.sumelectthermal: -708.191861 hartree
zpe.sumelectthermalent: -708.190917 hartree
zpe.sumelectthermalfe: -708.247605 hartree
dipole: -0.9202 0.5662 0.0004
dipole: 1.0805
quadrupole: -87.4028 -86.1742 -104.3486
quadrupole: -3.2017 0.0049 -0.0096
quadrupole: 5.2391 6.4676 -11.7067 -3.2017 0.0049 -0.0096
hfenergy: -708.4442546 hartree
pointgroup: C01 [X(C15H13N1O1)]
dipole: 0.3569041 -0.2309059 0.0003305 debye
polarizability: 299.3432751|-1.9032117|184.6762584|-0.4603082|-0.3561101|75.409825 unknown
InChI: InChI=1S/C15H13NO/c1-10-9-14(17-2)16-13-8-7-11-5-3-4-6-12(11)15(10)13/h3-9H,1-2H3
charge 0 multiplicity 1
30 atoms
O  -4.239647 -0.214067 0.006973
N  -2.177904 0.942751 -0.000404
C  -0.031588 -0.355546 0.000905
C  1.438149 -0.252794 -0.003299
C  -0.793972 0.879312 -0.002296
C  2.053995 1.062457 -0.007775
C  -0.818854 -1.582949 0.008634
C  -0.135775 2.161313 -0.00735
C  1.238585 2.250975 -0.009433
C  2.341023 -1.368889 -0.004154
C  -2.217791 -1.486071 0.01055
C  3.476262 1.203157 -0.011286
C  -0.260792 -2.99709 0.01597
C  -2.850888 -0.212259 0.005288
C  3.73397 -1.207842 -0.00791
C  4.318075 0.087789 -0.011165
C  -4.897438 1.108366 0.002145
H  -0.781587 3.04383 -0.009149
H  1.736258 3.227652 -0.0129
H  1.962216 -2.386676 -0.002543
H  -2.843381 -2.382353 0.016487
H  3.897396 2.215673 -0.014415
H  -1.089628 -3.724386 0.02563
H  0.350973 -3.206578 -0.880432
H  0.360617 -3.193553 0.908606
H  4.376053 -2.095829 -0.008515
H  5.406689 0.206571 -0.013894
H  -4.611794 1.688092 0.896556
H  -5.972995 0.878441 0.004134
H  -4.613525 1.680701 -0.897557
