program: Gaussian 09
title: 000269189
version: EM64L-G09RevD.01
frameworkgroup: C1[X(C14H15NO3)]
method: RPBEPBE
basis: SDD
operation: Freq
keyword: #p
keyword: freq=noraman
keyword: PBEPBE/SDD
title: #p freq=noraman PBEPBE/SDD
converged: YES YES NO NO
title: Mulliken charges:
elementType: O O O N C C C C C C C C C C C C C C H H H H H H H H H H H H H H H
charge: -0.272831 -0.278890 -0.215795 -0.217423 0.210362 0.468846 0.223469 -0.686247 -0.463887 0.128052 -0.380015 -0.350345 -0.664089 -0.282757 -0.239214 0.277504 -0.267548 -0.657935 0.251650 0.258060 0.254590 0.262941 0.255858 0.236776 0.235114 0.291365 0.232227 0.230577 0.225160 0.237553 0.219448 0.254937 0.222486
chargesum: 0.00000
title: Mulliken charges with hydrogens summed into heavy atoms:
elementType: O O O N C C C C C C C C C C C C C C
charge: -0.272831 -0.278890 -0.215795 -0.217423 0.210362 0.468846 0.223469 -0.176537 -0.209297 0.128052 -0.117075 -0.094487 0.099167 -0.050530 -0.008637 0.277504 0.195164 0.038937
polarizability: 2.02966706e+02 -2.15728418e+01 2.07311758e+02 1.84120474e+01 -4.21332538e-01 1.01770758e+02
1716.lowfreq: -4.5812 -0.0005 0.0005 0.0006 6.7881 8.9405 17.5395 37.3436 52.2517
frequency: 17.1834 37.3242 52.2319 70.4815 84.7778 117.2306 128.5029 176.1384 201.5186 220.3533 236.3791 240.6505 293.2978 307.0825 325.4155 342.6669 384.7823 419.8901 431.3618 442.3929 472.7181 504.7257 529.9545 576.2689 596.1310 601.8932 658.9184 687.7537 701.3195 722.9198 763.0245 763.8983 785.6862 806.2389 814.2583 865.0487 879.0930 898.2998 909.6926 951.8767 955.7895 985.1155 1014.3894 1041.6456 1049.1938 1080.4082 1092.2639 1101.4731 1121.7828 1144.4561 1156.5715 1167.7319 1183.6750 1209.1877 1226.7351 1266.6031 1278.3063 1303.0257 1307.9647 1324.3564 1354.7274 1381.5102 1393.4849 1403.2441 1422.8765 1448.2660 1456.6838 1458.1150 1464.8716 1474.2167 1484.2136 1498.9737 1501.6084 1560.3113 1569.5186 1619.8164 1644.0770 1652.3236 2987.4473 2993.5417 3023.7859 3030.5986 3074.8921 3087.4668 3087.7763 3094.5772 3116.8602 3120.1816 3134.8236 3147.8005 3165.4324 3172.4318 3179.3551
redmass: 4.7916 4.2847 4.1623 3.2650 5.4744 3.9614 3.7757 3.4283 2.0396 2.5012 2.1833 1.3334 3.3166 2.7026 4.3673 3.1413 4.3144 4.2701 3.5078 4.2716 5.0120 5.2835 3.3763 4.7241 4.9971 4.3281 5.5017 3.6844 4.9645 4.2016 1.3395 3.7397 4.0675 2.0757 1.8119 1.5943 1.8960 2.9491 2.5232 1.3746 2.1488 1.3187 2.9158 4.2638 2.5681 3.1457 2.6189 2.2945 1.3155 1.7361 1.6608 2.3721 1.0989 1.3870 1.8258 1.9260 1.1200 1.6252 1.7542 2.9244 1.2816 2.9859 1.2284 3.8183 1.4129 2.5136 1.1002 1.0905 1.0441 1.1674 1.0517 1.0523 2.3895 7.1223 7.3007 6.1595 8.0816 9.1987 1.0343 1.0361 1.0596 1.0597 1.1024 1.1015 1.0979 1.1028 1.0989 1.1061 1.0859 1.0904 1.0965 1.0928 1.0966
irintensity: 0.6555 0.3042 0.8732 1.2461 2.3895 1.8436 1.0869 0.6896 4.2472 3.8645 0.6617 2.5477 1.0735 8.9939 0.9175 1.3712 10.3434 4.5333 3.3314 6.3789 3.4705 9.5499 3.8122 3.6526 6.0974 1.4859 3.3249 1.0879 4.1796 16.1982 98.8043 1.1343 0.8243 4.3227 4.2432 4.1310 27.7598 5.8639 11.9277 3.7635 4.2730 0.1028 68.6300 1.3688 21.8524 32.9095 170.3688 52.4303 0.1274 4.6792 10.5339 23.6030 0.6353 65.0672 24.6001 23.5352 4.2020 51.6520 45.3838 3.7890 1.3504 39.6457 20.7765 3.1649 23.0878 56.1900 16.1003 17.3256 17.7254 72.7876 18.0096 18.8400 10.5675 36.9039 188.9272 3.2003 126.3883 306.2522 41.9563 14.3131 9.0033 34.2246 24.0839 3.6128 42.9953 2.6586 1.5002 29.1013 3.0332 7.2148 17.3329 2.1963 13.2169
temp: 298.150 k
press: 1.00000 atm
elementType: 8 8 8 7 6 6 6 6 6 6 6 6 6 6 6 6 6 6 1 1 1 1 1 1 1 1 1 1 1 1 1 1 1
symmnumber: 1
zpe: 689263.5 jmol-1
zpe.correction: 0.262527 hartree
zpe.thermalcorrener: 0.279209 hartree
zpe.thermalcorrenthalpy: 0.280153 hartree
zpe.thermalcorrgfe: 0.216681 hartree
zpe.sumelectzpe: -821.633520 hartree
zpe.sumelectthermal: -821.616838 hartree
zpe.sumelectthermalent: -821.615894 hartree
zpe.sumelectthermalfe: -821.679366 hartree
dipole: -2.8228 4.8534 -1.2043
dipole: 5.7423
quadrupole: -93.3596 -108.5458 -108.2406
quadrupole: 11.7878 2.6675 7.5166
quadrupole: 10.0224 -5.1638 -4.8586 11.7878 2.6675 7.5166
hfenergy: -821.8960466 hartree
pointgroup: C01 [X(C14H15N1O3)]
dipole: -0.8736819 2.0015883 -0.5782046 debye
polarizability: 197.9194739|-19.460972|211.819946|19.1794614|-8.360845|102.3098026 unknown
InChI: InChI=1S/C14H15NO3/c1-3-18-14(17)9-10-8-13(16)15(2)12-7-5-4-6-11(10)12/h4-8H,3,9H2,1-2H3
charge 0 multiplicity 1
33 atoms
O  -3.536906 -0.141357 -0.650484
O  2.821225 -3.006428 0.444927
O  -2.708647 -1.544804 1.023866
N  2.523063 -0.677993 0.256792
C  0.370564 0.231049 -0.530222
C  -0.130218 -1.133622 -0.660247
C  1.71967 0.429591 -0.065673
C  -1.544771 -1.395753 -1.159359
C  0.690259 -2.18946 -0.331128
C  2.062791 -2.029371 0.145367
C  -0.420841 1.372357 -0.847506
C  2.225437 1.755865 0.060056
C  3.90626 -0.485076 0.737012
C  0.089461 2.673903 -0.721248
C  1.41954 2.85987 -0.265182
C  -2.620952 -1.058949 -0.123339
C  -4.663204 0.267816 0.251207
C  -4.235538 1.416858 1.167767
H  -1.648249 -2.472383 -1.383669
H  -1.757848 -0.835539 -2.084964
H  0.348871 -3.225528 -0.406858
H  -1.450073 1.229166 -1.191569
H  3.246211 1.924874 0.410624
H  3.91841 0.094038 1.677446
H  4.517855 0.033924 -0.022356
H  4.323414 -1.486886 0.919717
H  -0.533104 3.538301 -0.972869
H  1.827886 3.871376 -0.163275
H  -5.45759 0.566708 -0.450981
H  -4.979392 -0.614911 0.834257
H  -5.102183 1.755982 1.764987
H  -3.44482 1.091091 1.863928
H  -3.865283 2.275487 0.581073
