program: Gaussian 09
title: 000269187
version: EM64L-G09RevD.01
frameworkgroup: C1[X(C15H14N2O3)]
method: RPBEPBE
basis: SDD
operation: Freq
keyword: #p
keyword: freq=noraman
keyword: PBEPBE/SDD
title: #p freq=noraman PBEPBE/SDD
converged: YES YES NO NO
title: Mulliken charges:
elementType: O O O N N C C C C C C C C C C C C C C C H H H H H H H H H H H H H H
charge: -0.196329 -0.263742 -0.246656 -0.430771 0.023423 -0.719222 0.601824 0.496911 -0.628396 0.199351 -0.380926 0.325594 -0.316173 -0.373321 -0.444329 -0.223519 -0.220732 -0.245031 0.214363 -0.785308 0.231691 0.237173 0.293518 0.255268 0.321144 0.237815 0.232949 0.360203 0.228032 0.228051 0.230942 0.245871 0.264798 0.245536
chargesum: 0.00000
title: Mulliken charges with hydrogens summed into heavy atoms:
elementType: O O O N N C C C C C C C C C C C C C C C
charge: -0.196329 -0.263742 -0.246656 -0.070568 0.023423 -0.250358 0.601824 0.496911 -0.334878 0.199351 -0.125658 0.325594 0.004971 -0.135506 -0.211380 0.004514 0.007319 -0.014089 0.214363 -0.029102
polarizability: 2.74212431e+02 1.22194198e+01 2.00381833e+02 1.77395798e+01 3.39097034e+00 1.28978734e+02
1716.lowfreq: -43.2985 -1.6369 -0.0007 -0.0005 0.0004 1.7226 4.9439 17.9885 23.6968
frequency: -43.2815 17.9590 23.6404 37.6115 53.6725 77.4140 99.7065 134.6366 153.5580 174.5628 186.4412 218.2770 267.9308 303.9557 328.7337 353.2012 365.9330 403.8747 414.5934 430.5841 461.2363 514.2108 523.7634 532.2717 587.1457 612.0934 616.8812 650.1299 666.0768 685.1912 705.0645 731.6720 736.4744 768.0395 805.1087 817.0862 855.2240 869.2010 892.1489 894.4306 911.1016 929.5237 937.2798 961.4703 978.1957 989.3144 990.6908 997.4146 1008.9416 1026.8373 1036.4097 1068.6138 1082.9244 1146.5573 1157.8480 1172.7898 1186.0109 1189.5396 1200.9316 1220.2031 1229.2636 1251.1843 1292.3801 1309.0891 1331.6470 1336.4200 1374.1952 1381.7963 1382.1167 1423.5851 1440.6408 1448.4119 1463.0599 1464.5839 1484.4869 1496.6660 1514.2281 1578.3246 1593.8893 1613.5017 1626.1900 1636.4465 2977.1462 2992.8526 3025.3300 3077.6747 3115.7684 3119.4543 3134.3342 3139.7383 3141.0948 3145.7842 3164.2256 3167.0340 3190.1637 3263.5453
redmass: 1.0629 5.4474 3.8689 4.9756 11.7639 3.6050 6.7898 4.8365 5.3767 6.3696 5.1285 4.6951 6.5520 3.5845 4.4940 4.6453 3.9747 2.8046 6.4728 4.0671 3.3393 5.7361 4.8117 3.5059 3.0942 4.6695 6.2231 5.1446 7.1668 6.6600 1.9235 5.3130 2.4979 3.4259 3.1447 4.5543 1.2486 1.4963 2.9373 1.1213 1.6640 1.5290 5.0109 1.8671 1.3914 1.7615 5.6129 1.3213 1.3372 2.2156 1.6764 2.9440 1.5861 1.7302 3.1740 1.0603 1.1461 1.1412 2.9777 1.8825 4.0505 1.8660 1.5992 2.5865 2.4503 1.8697 2.6572 1.2633 7.5912 5.1553 2.1144 1.1218 1.1477 1.0459 2.2069 3.0149 2.7515 3.7856 6.0584 6.1051 5.4951 4.8351 1.0602 1.0382 1.1002 1.0979 1.0877 1.0869 1.0907 1.0988 1.0912 1.0958 1.1014 1.0915 1.0947 1.0798
irintensity: 0.9688 0.1935 0.0155 0.0289 4.1366 2.4815 3.6822 4.6360 0.5659 9.7079 0.1131 1.3536 0.4333 0.6166 1.1792 1.4654 0.7735 0.1948 2.3617 0.0809 12.2960 7.9750 4.3853 15.0974 0.5178 10.8212 0.7894 18.2740 5.8313 0.8839 48.0580 3.3718 32.2087 14.4127 17.6085 0.3815 0.0706 37.7136 8.8591 72.7830 4.0448 2.7071 15.1321 9.0421 0.1279 38.5562 1.8389 0.6592 4.4878 9.3929 11.6148 2.3404 16.1530 107.4478 170.9288 1.1651 10.3285 10.8852 31.9424 62.4110 137.4520 25.7292 3.1820 48.3180 291.2733 217.0872 71.2681 87.5016 1.8886 15.1903 7.1938 31.5198 32.8161 19.4490 22.7321 53.9139 366.0884 285.8858 6.2610 7.2445 19.7907 65.4323 22.8715 3.0833 8.3042 10.1178 8.4747 6.1773 8.7360 8.8926 6.2609 39.4788 25.6521 4.0434 11.5524 111.0171
temp: 298.150 k
press: 1.00000 atm
elementType: 8 8 8 7 7 6 6 6 6 6 6 6 6 6 6 6 6 6 6 6 1 1 1 1 1 1 1 1 1 1 1 1 1 1
symmnumber: 1
zpe: 684793.8 jmol-1
zpe.correction: 0.260824 hartree
zpe.thermalcorrener: 0.277818 hartree
zpe.thermalcorrenthalpy: 0.278762 hartree
zpe.thermalcorrgfe: 0.213134 hartree
zpe.sumelectzpe: -913.699010 hartree
zpe.sumelectthermal: -913.682016 hartree
zpe.sumelectthermalent: -913.681071 hartree
zpe.sumelectthermalfe: -913.746700 hartree
dipole: -2.0339 -1.1254 -0.4886
dipole: 2.3753
quadrupole: -102.8769 -135.9971 -110.5200
quadrupole: -4.6504 2.2984 -4.2982
quadrupole: 13.5878 -19.5324 5.9446 -4.6504 2.2984 -4.2982
hfenergy: -913.9598339 hartree
pointgroup: C01 [X(C15H14N2O3)]
dipole: -0.7461567 -0.559458 0.0598287 debye
polarizability: 269.4622516|27.9054636|190.4570848|11.3087301|-28.2707991|143.6536626 unknown
InChI: InChI=1S/C15H14N2O3/c1-11(18)16-14-8-7-13(10-15(14)17(19)20)9-12-5-3-2-4-6-12/h2-8,10,16H,9H2,1H3
charge 0 multiplicity 1
34 atoms
O  1.870964 3.345322 -1.510958
O  3.646517 2.258783 -0.603537
O  3.4452 -2.360411 1.209609
N  3.361434 -0.183547 0.302428
N  2.381595 2.297641 -0.962137
C  -2.159689 0.279145 -1.487136
C  -0.720514 0.176818 -0.989382
C  -3.214711 -0.181316 -0.48179
C  0.184379 1.23393 -1.159401
C  1.533714 1.123109 -0.732009
C  -0.240527 -1.011967 -0.365643
C  2.024679 -0.080973 -0.111479
C  1.087887 -1.144911 0.059224
C  -3.274108 0.386707 0.817831
C  -4.168009 -1.168224 -0.835111
C  -4.264829 -0.019516 1.737888
C  -5.162277 -1.578201 0.083651
C  -5.213996 -1.00421 1.373869
C  4.010203 -1.267366 0.921842
C  5.479588 -0.988412 1.219102
H  -2.264205 -0.324519 -2.410721
H  -2.357782 1.328043 -1.782528
H  -0.123278 2.174237 -1.625895
H  -0.93367 -1.845995 -0.206811
H  1.440936 -2.062846 0.531938
H  -2.539097 1.147555 1.108181
H  -4.13441 -1.617488 -1.835817
H  3.907871 0.676473 0.106592
H  -4.298519 0.430207 2.736704
H  -5.891986 -2.342355 -0.206894
H  -5.982851 -1.319528 2.087954
H  6.039168 -0.776413 0.289526
H  5.916673 -1.870531 1.707858
H  5.591354 -0.113442 1.885453
