program: Gaussian 09
title: 000269181
version: EM64L-G09RevD.01
frameworkgroup: C1[X(C15H11ClN2)]
method: RPBEPBE
basis: SDD
operation: Freq
keyword: #p
keyword: freq=noraman
keyword: PBEPBE/SDD
title: #p freq=noraman PBEPBE/SDD
converged: YES YES NO NO
title: Mulliken charges:
elementType: Cl N N C C C C C C C C C C C C C C C H H H H H H H H H H H
charge: -0.045629 -0.017750 -0.671596 -0.154020 0.472697 -0.105244 0.367388 0.431453 -0.467290 -0.414400 -0.320344 -0.342605 -0.348228 -0.250178 -0.238624 -0.232285 -0.237414 -0.222485 0.232699 0.228831 0.259186 0.260204 0.224870 0.228464 0.257575 0.234018 0.302143 0.332496 0.236066
chargesum: 0.00000
title: Mulliken charges with hydrogens summed into heavy atoms:
elementType: Cl N N C C C C C C C C C C C C C C C
charge: -0.045629 -0.017750 -0.036957 -0.154020 0.472697 -0.105244 0.367388 0.431453 -0.234592 -0.185569 -0.061158 -0.342605 -0.088024 -0.025308 -0.010160 0.025290 -0.003395 0.013581
polarizability: 3.01490817e+02 -1.26231924e+00 1.76521813e+02 -1.66405602e+01 6.27910300e+00 1.10746639e+02
1716.lowfreq: -8.0974 -4.5260 -0.0020 -0.0013 -0.0009 4.8890 31.7666 50.7750 74.6122
frequency: 31.6995 50.7667 74.6099 124.1561 140.8864 151.1030 209.2343 253.1369 274.0825 292.2167 314.3129 369.9877 383.6075 396.6947 413.8469 435.8574 450.2759 474.3698 479.7770 509.9078 542.1279 562.0918 579.5928 611.1658 644.0379 696.4329 714.5863 721.3440 738.3966 758.6579 763.6277 798.6689 811.5283 853.3772 869.6036 891.5977 893.5943 952.4833 961.8495 987.3860 987.7498 991.1924 1014.3825 1020.7030 1051.0585 1057.6643 1120.2514 1120.9035 1162.9197 1171.7057 1207.6486 1219.3362 1247.0347 1258.4826 1296.4261 1344.4686 1361.1126 1372.5792 1404.2623 1417.9861 1444.8110 1455.2397 1470.8746 1492.7537 1548.2757 1565.9598 1600.1150 1605.9248 1623.2020 1639.6381 3116.7535 3118.5352 3135.2642 3137.4584 3150.8037 3151.3769 3164.6484 3168.0537 3175.4950 3551.9012 3690.9796
redmass: 6.8555 5.2800 4.6761 4.4780 7.6629 5.5342 5.8227 4.3552 4.6713 3.6245 4.5251 2.4436 1.7587 2.0005 2.1170 3.9769 4.0052 3.3035 3.3870 4.6719 5.4344 3.8743 4.4648 7.1644 6.4217 6.8610 5.1724 5.8633 3.3117 1.3494 1.3995 3.1315 4.1925 1.3935 1.4292 3.2710 2.3179 1.3914 1.3722 1.5688 1.3464 3.6672 2.2264 5.0976 1.6351 1.7980 1.6783 1.6504 1.1226 1.0579 1.6029 2.3578 2.0081 1.6304 2.4416 2.7267 7.5046 4.2077 3.4156 2.2965 3.6319 3.5046 3.3828 3.8896 7.3014 6.1580 6.1370 5.2753 6.6815 1.2515 1.0891 1.0892 1.0892 1.0857 1.0944 1.0905 1.0953 1.0997 1.1004 1.0452 1.1037
irintensity: 0.8257 1.6050 1.1391 6.1749 0.2339 0.9483 0.3390 0.6745 0.5883 5.5181 5.3541 2.3726 1.2613 81.9953 148.0188 2.7645 15.4326 3.1890 4.1293 4.9948 3.0304 0.9480 1.3110 7.5877 13.4974 17.9344 0.6682 6.2315 11.2922 39.4978 96.0147 9.3454 1.8213 26.7082 0.0966 8.2684 16.0045 1.5565 4.6597 4.9651 0.5644 17.8969 15.7388 38.7190 10.5536 11.6353 1.8059 7.4545 4.9983 0.7751 20.3477 0.9460 0.0930 4.0685 25.2448 50.7654 3.2663 34.1888 2.6974 27.8037 59.5209 49.9168 13.0380 21.2966 3.1706 7.8263 12.4322 28.0614 40.5440 191.2999 1.6130 21.4379 14.0674 1.2775 31.6669 8.5196 9.0607 30.5628 17.3901 80.2511 30.9488
temp: 298.150 k
press: 1.00000 atm
elementType: 17 7 7 6 6 6 6 6 6 6 6 6 6 6 6 6 6 6 1 1 1 1 1 1 1 1 1 1 1
symmnumber: 1
zpe: 574318.8 jmol-1
zpe.correction: 0.218746 hartree
zpe.thermalcorrener: 0.233291 hartree
zpe.thermalcorrenthalpy: 0.234235 hartree
zpe.thermalcorrgfe: 0.176642 hartree
zpe.sumelectzpe: -1146.548297 hartree
zpe.sumelectthermal: -1146.533752 hartree
zpe.sumelectthermalent: -1146.532808 hartree
zpe.sumelectthermalfe: -1146.590401 hartree
dipole: 1.4296 -1.4237 -2.5723
dipole: 3.2691
quadrupole: -90.9985 -100.0904 -113.1085
quadrupole: 4.4949 -2.6411 5.1052
quadrupole: 10.4006 1.3088 -11.7094 4.4949 -2.6411 5.1052
hfenergy: -1146.7670431 hartree
pointgroup: C01 [X(C15H11Cl1N2)]
dipole: -0.5614649 1.0642997 -0.4541637 debye
polarizability: 301.7110602|-13.2599113|160.7617987|1.4928806|29.8249379|126.2864104 unknown
InChI: InChI=1S/C15H11ClN2/c16-12-7-3-2-6-11(12)15-13(17)9-10-5-1-4-8-14(10)18-15/h1-9H,17H2
charge 0 multiplicity 1
29 atoms
Cl -2.142212 0.731025 2.50429
N  0.508216 -0.823629 -0.262178
N  -0.724386 2.652989 0.151987
C  -0.316936 0.224297 -0.090474
C  2.451986 0.68134 0.019498
C  1.879632 -0.629977 -0.210944
C  0.165849 1.588042 0.096171
C  -1.784974 -0.075091 -0.181128
C  1.558814 1.782779 0.161697
C  3.880099 0.809291 0.075172
C  2.739688 -1.75976 -0.382114
C  -2.71285 0.125306 0.870622
C  -2.290824 -0.642083 -1.383618
C  4.697909 -0.310768 -0.092856
C  4.127529 -1.605067 -0.324212
C  -4.081839 -0.187481 0.746986
C  -3.655984 -0.96098 -1.533898
C  -4.556958 -0.725469 -0.469309
H  1.964907 2.791945 0.306262
H  4.321769 1.798017 0.25062
H  2.270806 -2.734226 -0.551816
H  -1.57934 -0.83628 -2.192515
H  5.787775 -0.203796 -0.048075
H  4.785415 -2.47145 -0.452443
H  -4.756179 -0.027893 1.593323
H  -4.014759 -1.395323 -2.472837
H  -0.38774 3.592613 0.344534
H  -1.727139 2.48961 0.177827
H  -5.619177 -0.970982 -0.572974
