program: Gaussian 09
title: 000269184
version: EM64L-G09RevD.01
frameworkgroup: C1[X(C13H11NO5)]
method: RPBEPBE
basis: SDD
operation: Freq
keyword: #p
keyword: freq=noraman
keyword: PBEPBE/SDD
title: #p freq=noraman PBEPBE/SDD
converged: YES YES NO NO
title: Mulliken charges:
elementType: O O O O O N C C C C C C C C C C C C C H H H H H H H H H H H
charge: -0.269996 -0.414706 -0.382170 -0.216956 -0.252026 0.041008 0.246748 0.449285 -0.075017 -0.535728 0.297064 -0.344243 -0.313214 -0.628941 -0.436805 -0.042485 0.210578 0.125792 -0.528976 0.276044 0.264538 0.270585 0.244063 0.249458 0.284002 0.249804 0.235173 0.233916 0.382004 0.381198
chargesum: 0.00000
title: Mulliken charges with hydrogens summed into heavy atoms:
elementType: O O O O O N C C C C C C C C C C C C C
charge: -0.269996 -0.032702 -0.000971 -0.216956 -0.252026 0.041008 0.246748 0.449285 -0.075017 -0.259684 0.297064 -0.079705 -0.042629 -0.135419 -0.152803 -0.042485 0.210578 0.125792 0.189918
polarizability: 2.67516081e+02 -8.28496874e+00 1.84391696e+02 -1.16621703e+01 3.48089322e+00 8.59325145e+01
1716.lowfreq: -7.0849 -0.0015 -0.0012 -0.0012 1.3412 5.8852 22.3882 34.4648 44.6073
frequency: 22.3582 34.4628 44.5979 48.5705 95.0532 97.4447 136.4396 150.5190 159.4231 183.4008 206.0643 248.7072 254.6175 311.7411 336.8758 357.9919 402.9217 406.1161 434.4457 477.2512 498.9483 515.1503 528.6892 549.8475 571.6588 604.9632 611.1309 634.1272 643.6446 666.5397 691.5038 752.6454 761.6698 793.4008 813.0456 836.1260 862.5173 876.7078 893.5862 907.2858 922.5943 948.8264 962.5546 990.6277 1047.8758 1057.8879 1087.7949 1114.1221 1129.1408 1149.8792 1159.9279 1178.5256 1201.5590 1249.2714 1271.2188 1281.1810 1292.0020 1304.6011 1337.2659 1368.5582 1403.4750 1409.5818 1439.6098 1454.3675 1465.4435 1468.0480 1474.9915 1503.1755 1548.7784 1574.2140 1613.2553 1631.1590 1672.1049 2977.5839 3026.9460 3072.8266 3104.8673 3138.8220 3144.5865 3159.6767 3172.1820 3188.1160 3509.7492 3510.3829
redmass: 6.3098 12.3957 7.4876 10.0546 3.3859 7.3916 6.1808 3.9273 3.3643 3.5538 2.3749 2.1800 3.9515 6.4836 5.6636 5.9246 2.7196 4.2856 3.3668 4.8022 6.1017 3.2460 5.6426 4.4821 2.2118 4.1780 2.2959 2.9037 1.8756 3.1035 4.6906 5.2058 5.8064 3.2362 4.1547 3.6507 2.0465 7.2323 1.5190 2.4417 2.3876 2.1591 4.8481 1.3520 2.9148 1.9529 3.1648 1.2590 1.7024 1.4581 1.3975 1.2120 2.1366 1.8940 1.9565 1.5530 3.3761 2.2111 2.9807 3.6551 7.2475 3.4875 1.2913 1.1138 1.5469 1.0734 1.6763 4.1698 7.7314 7.4782 8.5685 7.0156 8.6244 1.0320 1.0606 1.1047 1.1021 1.1012 1.0890 1.0921 1.0968 1.0917 1.0639 1.0640
irintensity: 0.9545 0.8620 0.2872 2.1131 4.2420 0.6348 1.2988 2.8117 1.1176 0.2973 2.4019 2.6413 4.7492 3.0998 0.8752 4.0987 3.3788 1.3173 0.8604 20.2560 15.0064 12.3894 5.0633 24.5488 57.8803 25.6491 50.3298 137.6661 116.1820 27.9801 22.4656 4.2640 18.2037 2.7698 14.5508 22.0363 27.5193 24.1697 34.1250 1.8517 23.6773 43.6804 36.8378 0.7757 277.2059 233.3948 28.3585 0.2313 66.4330 41.6979 0.5318 34.9787 23.7594 12.1448 25.2180 8.7915 39.4537 61.4838 30.0686 187.3719 14.8737 36.8034 0.8280 24.4234 61.0059 15.3711 29.5129 79.5974 34.3901 70.6726 273.9196 28.6645 250.7130 50.7522 11.6757 33.2016 3.5762 15.7145 2.5378 3.7986 6.0548 4.8923 45.0042 25.6593
temp: 298.150 k
press: 1.00000 atm
elementType: 8 8 8 8 8 7 6 6 6 6 6 6 6 6 6 6 6 6 6 1 1 1 1 1 1 1 1 1 1 1
symmnumber: 1
zpe: 575054.2 jmol-1
zpe.correction: 0.219027 hartree
zpe.thermalcorrener: 0.236099 hartree
zpe.thermalcorrenthalpy: 0.237043 hartree
zpe.thermalcorrgfe: 0.172027 hartree
zpe.sumelectzpe: -931.510769 hartree
zpe.sumelectthermal: -931.493697 hartree
zpe.sumelectthermalent: -931.492752 hartree
zpe.sumelectthermalfe: -931.557768 hartree
dipole: 1.0777 1.3092 -1.0016
dipole: 1.9694
quadrupole: -105.3202 -96.2359 -110.1514
quadrupole: -11.5437 -3.9454 -5.1718
quadrupole: -1.4177 7.6666 -6.2489 -11.5437 -3.9454 -5.1718
hfenergy: -931.7297952 hartree
pointgroup: C01 [X(C13H11N1O5)]
dipole: 0.4536403 0.4525297 -0.4356287 debye
polarizability: 263.199355|-17.1827535|187.28056|-20.0691627|1.9097762|87.360376 unknown
InChI: InChI=1S/C13H11NO5/c1-19-11-6-10(13(17)18)14-9-3-2-7(4-8(9)11)5-12(15)16/h2-4,6,15,17H,5H2,1H3
charge 0 multiplicity 1
30 atoms
O  -0.323872 2.755524 -0.117716
O  5.058151 -1.825278 0.386389
O  -4.277634 -1.879373 0.699653
O  5.169837 0.369272 1.145012
O  -4.839132 0.367974 0.78495
N  -1.667965 -1.27424 0.188131
C  0.142097 0.405166 -0.181069
C  2.412854 -0.421173 -0.618775
C  -0.343361 -0.954197 -0.071759
C  1.521031 0.646376 -0.454379
C  -0.822612 1.464375 -0.005201
C  1.932919 -1.769367 -0.504524
C  0.588671 -2.028499 -0.240019
C  3.889725 -0.159216 -0.912729
C  -2.157498 1.140995 0.258099
C  -2.522021 -0.242561 0.3430
C  4.761592 -0.45443 0.301447
C  -3.96881 -0.527253 0.626028
C  -1.26504 3.871526 0.064301
H  1.86727 1.681609 -0.529509
H  2.64176 -2.596147 -0.622412
H  0.200964 -3.047699 -0.152638
H  4.046331 0.897703 -1.179831
H  4.229773 -0.795808 -1.748211
H  -2.942447 1.885866 0.40269
H  -0.65697 4.778838 -0.057462
H  -1.713026 3.847775 1.074993
H  -2.062458 3.843184 -0.701358
H  5.590181 -1.998274 1.210355
H  -5.251812 -1.966664 0.889243
